{"text_format":"1","workbook":"xlsx","n_sheets":6,"sheets":["INTRODUCTION","INPUT","SAMPLING PLANS","CALCULATIONS","REVISION","RANDOM SELECTOR TOOL"],"not_rendered":{"charts":0,"images":1,"macros":1,"external_links":1,"defined_names":15,"comments":4,"pivot_tables":0},"unopened":[],"bounds":{"document_bytes":16777216,"sheet_cells":100000,"rows_first":2000,"rows_last":500,"rows_between":2000,"halvings":0,"cell_chars":16384,"cell_head_chars":4096},"cells_cut":0,"cells_raw":0,"read":"whole","date_system":"1900"}

{"sheet":"INTRODUCTION","index":0,"n_rows":41,"n_cols":2,"rows_kept":41,"cut":false,"hidden":false,"merged":[]}
[null,"A Template for You to Develop Sampling Plans for the NTD Sampling Method"]
[]
[null,"What can I do with this template?"]
[]
[null,"You can use it to develop template sampling plans for obtaining annual data on unlinked passenger trips (UPT) and passenger miles traveled (PMT) for a particular mode and type of service.  When you follow the steps for this template and the guidance in the NTD Sampling Manual, the resulting sampling plans meet FTA's 95% confidence and 10% precision levels.         "]
[]
[null,"What do I need to know before using this template?"]
[]
[null,"You should go over Subsection 54 of the NTD Sampling Manual, which is available at https://www.transit.dot.gov/ntd/ntd-sampling-manual ."]
[]
[null,"What is in the content of this template?"]
[]
[null,"This template consists of six worksheets:"]
[]
[null,"a) INTRODUCTION: You should go over the general directions in this worksheet to using this template."]
[]
[null,"b) INPUT: You must use this worksheet to enter your data."]
[]
[null,"c) SAMPLING PLANS: You must go there to see the sampling plans you have developed after you have entered your data into INPUT."]
[]
[null,"d) CALCULATIONS: You do not need to go there for using this template.  If you are interested, it does provide a number of characteristics of your service as reflected in the information you enter into INPUT.   "]
[]
[null,"e) REVISION: You do not need to use the information in this worksheet for developing this set of template sampling plans.  You will need to use it in the future to determine whether you need to revise this set of template sampling plans. "]
[]
[null,"f) RANDOM SELECTOR TOOL: You can use this to select a random sample given your complete list of trips."]
[]
[null,"What information do I need to use this template?"]
[]
[null,"You must have a set of sample data collected from the mode and type of service for which you would like to have a new sampling plan that reflects its conditions.  "]
[]
[null,"How do I enter the information?"]
[]
[null,"You must follow the steps in INPUT and enter the information accordingly."]
[]
[null,"How do I use the resulting sampling plans?"]
[]
[null,"You should follow the NTD Sampling Manual in using the template sampling plans.  SAMPLING PLANS also describes the options."]
[]
[null,"Is there an example of using this template that I can take a look at before I use it myself?"]
[]
[null,"\"The NTD Sampling Template with Sample Data.xls\" at https://www.transit.dot.gov/ntd/ntd-sampling-template-data-downloadable-excel-file illustrates the use of this template with real sample data."]

{"sheet":"INPUT","index":1,"n_rows":619,"n_cols":26,"rows_kept":619,"cut":false,"hidden":false,"merged":[[47,1,47,12],[68,9,68,14],[2,1,2,12],[21,1,22,12],[30,1,30,12],[35,1,35,12],[42,1,42,12]]}
[null,"Input"]
[]
[null,"Before you start, gather your data from your prior year sample. You must at least have UPT and PMT. Date, ID, PPMT, and Group are all optional."]
[]
[null,"A. Common Data"]
[]
[null,"1. To use this template, enter your prior year sample data for both UPT and PMT in section E below."]
[]
[null,"a) Enter UPT data in column D"]
[null,"b) Enter PMT data in column E"]
[null,"c) Start in row 71."]
[]
[null,"It is critical that you enter the data in the right columns!"]
[]
[null,"2. You may choose to enter some identification information for your sample:"]
[]
[null,"a) The dates on which your sample data were collected in column B, \"Date\"."]
[null,"b) Some other identification, e.g., trip number, trip time, etc., in column C, \"ID\"."]
[]
[null,"B. Group Size"]
[]
[null,"1. Most agencies do not use route grouping. If you do not use route grouping, skip this section. The NTD Sampling Manual discusses route grouping in the section \"Route Grouping Option\". If you choose to use route grouping, you must also enter three additional pieces of information:"]
[]
[null,"a) The name of the group to which each vehicle trip in the sample belongs:"]
[]
[null,"i) Enter the group names in column G starting in row 71."]
[null,"ii) You may have up to 10 distinct groups. However, using more than 3 groups will usually add complexity without making the sample more efficient."]
[null,"iii) The names can be numeric or text."]
[null,"iv) The names automatically appear in ranges D33:M33 and D38:M38 in this sheet, in range E6:N6 in CALCULATIONS, and in range F7:O7 in SAMPLING PLANS."]
[]
[null,"                b) For each group, enter the number of vehicle trips in the group during the year (or other period) you collected the sample data you are entering below. This is the number for the entire period, not just in the sample itself! After you enter the sample data below, come back and enter the group size (number of vehicle trips) in cells D34:M34.",null,null,null,null,null,null,null,null,null,null,null,null,null,"The tables in P33:Y34 and P38:Y39 are only used for plan revision. If you are revising your plan, follow the instructions in the REVISION tab. Otherwise leave these tables blank."]
[null,null,null,{"$f":"uniqueitems(Group,FALSE)","v":"Short Routes"},"Medium Routes","Long Routes",0,{"$error":"#N/A"},{"$error":"#N/A"},{"$error":"#N/A"},{"$error":"#N/A"},{"$error":"#N/A"},{"$error":"#N/A"},null,null,{"$f":"uniqueitems(Group_orig,FALSE)","v":0},0,0,0,0,0,0,0,0,0]
[null,"i) Group Names",null,{"$f":"IF(ISERROR(D32),\"\",IF(D32=0,\"\",D32))","v":"Short Routes"},"Medium Routes","Long Routes","","","","","","","","ALL",null,{"$f":"IF(ISERROR(P32),\"\",IF(P32=0,\"\",P32))","v":""},"","","","","","","","","","ALL"]
[null,"ii) Group Size",null,109685,331033,35325,null,null,null,null,null,null,null,{"$f":"+IF(SUM(D34:M34)=0,\" \",SUM(D34:M34))","v":476043},null,null,null,null,null,null,null,null,null,null,null,{"$f":"+IF(SUM(P34:Y34)=0,\" \",SUM(P34:Y34))","v":" "}]
[]
[null,"              c) For each group, enter the number of vehicle trips you expect to operate during the coming sample year. This is the number for the entire year, not just in the sample itself! After you enter the sample data below, come back and enter the group size (number of vehicle trips) in cells D39:M39."]
[]
[null,"i) Group Names",null,{"$f":"+D33","v":"Short Routes"},{"$f":"+E33","v":"Medium Routes"},"Long Routes","","","","","","","","ALL",null,{"$f":"+P33","v":""},{"$f":"+Q33","v":""},"","","","","","","",""]
[null,"ii) Group Size",null,109685,331033,35325,null,null,null,null,null,null,null,{"$f":"+IF(SUM(D39:M39)=0,\" \",SUM(D39:M39))","v":476043}]
[]
[null,"2. It is critical that:"]
[]
[null,"                  a) You enter group size in the same service units as you have chosen for your template sampling plans.  For example, if you want your sample size in one-way bus trips, group size must be in one-way bus trips as well. For non-scheduled modes, use vehicle days instead of vehicle trips."]
[null,"b) You enter group size data in the right cells to match group names."]
[]
[null,"C. PPMT Data (uncommon)"]
[]
[null,"1. If you choose to consider the PPMT option, you must also enter your sample data for PPMT in column F starting in row 71."]
[]
[null,"D. Is 100% Count of UPT Available by Service Group?"]
[]
[null,"1. If 100% counts of UPT are available by service group, enter 1 in cell M52. If not, enter 0. If you are not using grouping, leave M52 blank.",null,null,null,null,null,null,null,null,null,null,1]
[]
[null,"E. Sample Data"]
[]
[null,"1. We suggest that you start by organizing your prior year sample data for Date, ID, UPT, PMT, PPMT, and Group side by side in a separate spreadsheet."]
[]
[null,"2. Copy the full range of the sample data from this separate spreadsheet."]
[]
[null,"3. Paste the sample data as follows:"]
[]
[null,"a) Click cell B71 if you include the two identification columns and cell D71 otherwise"]
[null,"b) Right Click "]
[null,"c) Locate Paste Options"]
[null,"d) Select Paste Values"]
[null,"e) Click OK."]
[]
[null,"4. Make sure that all data on UPT, PMT, PPMT, and Group from other applications are cleared at the bottom."]
[null,"Once you have entered all required data on this tab, proceed to the SAMPLING PLANS tab.",null,null,null,null,null,null,null,"ORIGINAL SAMPLING YEAR DATA: only use this table when you are revising your sampling plan as described in \"Revision\" in the manual. Otherwise leave it blank."]
[null,"Date","ID","UPT","PMT","PPMT","Group",null,null,"Date","ID","UPT","PMT","PPMT","Group"]
[null,"2006-01-02","15:02:00",37,126.2,358.93200000000002,"Short Routes"]
[null,"2006-01-02","16:30:00",33,248,449.35038416763672,"Medium Routes"]
[null,"2006-01-02","14:49:00",23,83.8,283.84245267489712,"Medium Routes"]
[null,"2006-01-04","14:40:00",13,58.3,152.64720124258685,"Medium Routes"]
[null,"2006-01-04","16:41:00",20,122.7,289.83492019990325,"Medium Routes"]
[null,"2006-01-04","5:41PM",27,206.1,456.00853059087524,"Medium Routes"]
[null,"2006-01-06","5:44AM",18,98.6,311.26002391595887,"Medium Routes"]
[null,"2006-01-06","7:30PM",4,16.7,58.156887336886605,"Medium Routes"]
[null,"2006-01-06","9:07PM",12,34.4,161.17262724935733,"Medium Routes"]
[null,"2006-01-08","2:23PM",42,184.9,726.27338913723736,"Medium Routes"]
[null,"2006-01-08","10:23AM",22,111.6,380.42891811950528,"Medium Routes"]
[null,"2006-01-08","3:10PM",19,98.9,176.66353598399033,"Short Routes"]
[null,"2006-01-10","9:59PM",2,19.600000000000001,29.078443668443303,"Medium Routes"]
[null,"2006-01-10","6:13AM",16,73.5,232.62754934754642,"Medium Routes"]
[null,"2006-01-10","6:50PM",5,26.5,62.408272727272731,"Medium Routes"]
[null,"2006-01-12","12:33PM",35,150.30000000000001,527.97955137254905,"Medium Routes"]
[null,"2006-01-12","11:49AM",67,292.60000000000002,1452.933858569904,"Long Routes"]
[null,"2006-01-14","9:46AM",25,76.900000000000006,298.1997857776027,"Medium Routes"]
[null,"2006-01-14","12:10PM",3,16.2,33.395671658347197,"Medium Routes"]
[null,"2006-01-14","4:20PM",5,1.6,12.890684931506849,"Short Routes"]
[null,"2006-01-16","4:43PM",32,136.19999999999999,482.72416125490196,"Medium Routes"]
[null,"2006-01-16","12:40PM",9,44.5,68.24443659849301,"Short Routes"]
[null,"2006-01-16","4:56PM",9,25.3,112.33489090909092,"Medium Routes"]
[null,"2006-01-18","5:27AM",17,118.5,231.48353123787348,"Medium Routes"]
[null,"2006-01-18","6:10PM",8,36,89.055124422259198,"Medium Routes"]
[null,"2006-01-18","7:40AM",6,21.6,60.3214054054054,"Medium Routes"]
[null,"2006-01-20","3:25PM",18,32.299999999999997,271.53234070588235,"Medium Routes"]
[null,"2006-01-20","7:51AM",54,226.4,933.7800717478766,"Medium Routes"]
[null,"2006-01-20","5:21PM",27,161.6,456.00853059087524,"Medium Routes"]
[null,"2006-01-22","3:10PM",28,87.9,260.3462635553542,"Short Routes"]
[null,"2006-01-22","11:12AM",7,46.4,109.92969892555055,"Medium Routes"]
[null,"2006-01-22","2:10PM",14,47.9,164.38929364586278,"Medium Routes"]
[null,"2006-01-24","1:30PM",19,82.9,276.24521485021137,"Medium Routes"]
[null,"2006-01-24","4:10PM",10,63.6,111.318905527824,"Medium Routes"]
[null,"2006-01-24","5:40AM",3,21.6,30.1607027027027,"Medium Routes"]
[null,"2006-01-26","5:40AM",8,46.7,150.90591906634532,"Medium Routes"]
[null,"2006-01-26","10:10AM",47,150.9,631.25945672664955,"Medium Routes"]
[null,"2006-01-28","3:23PM",54,227.9,933.7800717478766,"Medium Routes"]
[null,"2006-01-28","12:11PM",21,168.5,396.12803754915649,"Medium Routes"]
[null,"2006-01-28","9:28AM",19,106.6,211.40808314736756,"Medium Routes"]
[null,"2006-01-30","6:20PM",48,243.2,1040.9078389754536,"Long Routes"]
[null,"2006-01-30","5:40AM",6,13.8,38.993366128691243,"Short Routes"]
[null,"2006-01-30","11:37AM",53,225.5,800.47374708356949,"Medium Routes"]
[null,"2006-02-01","5:40AM",2,9.4,19.40172972972973,"Short Routes"]
[null,"2006-02-01","12:30PM",29,83.2,269.64434439661682,"Short Routes"]
[null,"2006-02-01","4:40PM",27,179.2,407.78851266521463,"Medium Routes"]
[null,"2006-02-03","4:47AM",10,51.5,119.27991431104107,"Medium Routes"]
[null,"2006-02-03","2:29PM",8,18.3,80.025489676665359,"Medium Routes"]
[null,"2006-02-03","6:19PM",24,127,405.34091608077802,"Medium Routes"]
[null,"2006-02-05","2:32PM",13,38.5,120.87505093641444,"Short Routes"]
[null,"2006-02-05","7:08AM",17,128.80000000000001,320.67507801598379,"Medium Routes"]
[null,"2006-02-05","3:30PM",2,0.2,5.1562739726027393,"Short Routes"]
[null,"2006-02-07","1:21PM",24,78.2,286.27179434649861,"Medium Routes"]
[null,"2006-02-07","5:59PM",3,13.7,30.00955862874951,"Medium Routes"]
[null,"2006-02-07","4:40PM",24,86.6,483.74941512605039,"Long Routes"]
[null,"2006-02-09","6:20AM",48,193.2,1040.9078389754536,"Long Routes"]
[null,"2006-02-09","5:55PM",18,119.1,200.28134192908507,"Medium Routes"]
[null,"2006-02-09","12:37PM",8,30.7,80.428540540540538,"Medium Routes"]
[null,"2006-02-11","10:10AM",11,76.400000000000006,173.12068920676205,"Medium Routes"]
[null,"2006-02-11","7:30AM",5,47.3,72.696109171108262,"Medium Routes"]
[null,"2006-02-11","7:19AM",10,30.5,123.40976203256396,"Medium Routes"]
[null,"2006-02-13","1:40PM",10,37.799999999999997,100.0318620958317,"Medium Routes"]
[null,"2006-02-13","7:34AM",17,50.2,158.06737430146504,"Short Routes"]
[null,"2006-02-13","9:58AM",2,1.6,18.596161682525299,"Short Routes"]
[null,"2006-02-15","10:40AM",17,70.599999999999994,191.871515229832,"Medium Routes"]
[null,"2006-02-15","6:50PM",33,154,715.62413929562433,"Long Routes"]
[null,"2006-02-15","6:55AM",5,25.4,55.659452763912,"Medium Routes"]
[null,"2006-02-17","10:10AM",29,80.400000000000006,456.40908972691813,"Medium Routes"]
[null,"2006-02-17","2:57PM",85,308.8,1843.2742981856991,"Long Routes"]
[null,"2006-02-17","11:40AM",17,59.1,342.65583571428567,"Long Routes"]
[null,"2006-02-19","2:28PM",23,88.8,498.76833950907155,"Long Routes"]
[null,"2006-02-19","7:18PM",51,224.2,331.44361209387557,"Short Routes"]
[null,"2006-02-19","7:56AM",28,135.4,422.89179091207444,"Medium Routes"]
[null,"2006-02-21","5:45AM",16,88,251.81191157347206,"Medium Routes"]
[null,"2006-02-21","7:40AM",8,47.3,60.661721420882671,"Short Routes"]
[null,"2006-02-21","6:27AM",16,128.4,270.22727738718532,"Medium Routes"]
[null,"2006-02-23","5:01PM",4,18.600000000000001,49.146974358974362,"Medium Routes"]
[null,"2006-02-23","9:40AM",18,80.599999999999994,211.3576632589664,"Medium Routes"]
[null,"2006-02-23","7:50PM",0,0,0,"Short Routes"]
[null,"2006-02-25","10:01PM",6,26.2,67.719358316411302,"Medium Routes"]
[null,"2006-02-25","7:10AM",32,147.4,553.35115362837132,"Medium Routes"]
[null,"2006-02-25","6:59PM",5,19.5,78.521213518250391,"Medium Routes"]
[null,"2006-02-27","4:10PM",40,232.8,544.66713232440816,"Medium Routes"]
[null,"2006-02-27","3:11PM",35,271.39999999999998,660.21339591526078,"Medium Routes"]
[null,"2006-02-27","9:37AM",1,6,10.053567567567567,"Medium Routes"]
[null,"2006-03-01","10:26AM",13,45.5,98.575297308934339,"Short Routes"]
[null,"2006-03-01","7:26AM",7,26.3,86.007205128205129,"Medium Routes"]
[null,"2006-03-01","3:10PM",29,85.3,437.99506915893426,"Medium Routes"]
[null,"2006-03-03","7:10PM",24,147.30000000000001,377.71786736020806,"Medium Routes"]
[null,"2006-03-03","8:46AM",11,85.9,149.78346138921225,"Medium Routes"]
[null,"2006-03-03","5:49PM",8,34.5,99.85323636363637,"Medium Routes"]
[null,"2006-03-05","4:10PM",9,33.700000000000003,101.57903747461694,"Medium Routes"]
[null,"2006-03-05","1:49PM",14,61.8,211.19182054901961,"Medium Routes"]
[null,"2006-03-05","9:23AM",34,132.9,587.93560073014453,"Medium Routes"]
[null,"2006-03-07","4:21PM",18,97.8,203.15807494923388,"Medium Routes"]
[null,"2006-03-07","5:39AM",9,48.4,87.30778378378379,"Short Routes"]
[null,"2006-03-07","5:40AM",6,36.5,74.889927272727277,"Medium Routes"]
[null,"2006-03-09","10:57PM",28,116.8,484.18225942482491,"Medium Routes"]
[null,"2006-03-09","9:19AM",39,126.2,845.73761916755609,"Long Routes"]
[null,"2006-03-09","6:40AM",19,70,286.96228669033621,"Medium Routes"]
[null,"2006-03-11","2:10PM",12,74.400000000000006,135.4387166328226,"Medium Routes"]
[null,"2006-03-11","2:19PM",20,168,246.81952406512792,"Medium Routes"]
[null,"2006-03-11","11:52AM",12,94.1,173.90095211994196,"Medium Routes"]
[null,"2006-03-13","10:10AM",15,76.2,166.90111827423755,"Medium Routes"]
[null,"2006-03-13","2:40PM",12,53,120.6428108108108,"Medium Routes"]
[null,"2006-03-13","5:10PM",0,0,0,"Short Routes"]
[null,"2006-03-15","12:57PM",61,195.7,1054.8256366040828,"Medium Routes"]
[null,"2006-03-15","7:19AM",50,193.1,1084.2789989327641,"Long Routes"]
[null,"2006-03-15","8:11AM",42,203,709.34660314136147,"Medium Routes"]
[null,"2006-03-17","1:44PM",84,374.1,1452.5467782744747,"Medium Routes"]
[null,"2006-03-17","10:11AM",46,312.10000000000002,867.70903463148557,"Medium Routes"]
[null,"2006-03-17","6:55AM",5,24.2,55.659452763912,"Medium Routes"]
[null,"2006-03-19","7:18PM",4,13.1,25.995577419127496,"Short Routes"]
[null,"2006-03-19","1:20PM",16,123,241.65245194975682,"Medium Routes"]
[null,"2006-03-19","11:50AM",19,97.1,286.96228669033621,"Medium Routes"]
[null,"2006-03-21","4:38PM",64,289.10000000000002,1387.8771186339382,"Long Routes"]
[null,"2006-03-21","4:56PM",9,48.2,122.55010477299184,"Medium Routes"]
[null,"2006-03-21","6:25AM",5,10,46.490404206313244,"Short Routes"]
[null,"2006-03-23","2:38PM",65,197.1,1409.5626986125935,"Long Routes"]
[null,"2006-03-23","2:41PM",27,83.8,392.55898952398456,"Medium Routes"]
[null,"2006-03-23","7:21PM",11,59,172.74666974015088,"Medium Routes"]
[null,"2006-03-25","8:37AM",25,116.2,542.13949946638206,"Long Routes"]
[null,"2006-03-25","8:10PM",9,35.4,141.33818433285072,"Medium Routes"]
[null,"2006-03-25","2:51PM",26,113.2,439.11932575417615,"Medium Routes"]
[null,"2006-03-27","5:49PM",34,143.80000000000001,737.30971927427959,"Long Routes"]
[null,"2006-03-27","10:03AM",7,14.4,86.007205128205129,"Medium Routes"]
[null,"2006-03-27","5:40PM",37,259.60000000000002,558.82129513381267,"Medium Routes"]
[null,"2006-03-29","2:47PM",26,102.7,310.12777720870679,"Medium Routes"]
[null,"2006-03-29","4:17PM",11,28.5,71.487837902600617,"Short Routes"]
[null,"2006-03-29","5:41AM",38,354,641.7897837945651,"Medium Routes"]
[null,"2006-03-31","4:30PM",10,36.1,216.85579978655284,"Long Routes"]
[null,"2006-03-31","6:10AM",10,32,64.988943547818735,"Short Routes"]
[null,"2006-03-31","2:10PM",21,74.7,258.02161538461542,"Medium Routes"]
[null,"2006-04-02","8:10PM",10,59.9,112.86559719401882,"Medium Routes"]
[null,"2006-04-02","5:00PM",3,18.7,60.468676890756299,"Long Routes"]
[null,"2006-04-02","10:56AM",34,221,513.51146039323328,"Medium Routes"]
[null,"2006-04-04","7:17PM",45,238.6,778.15005978989711,"Medium Routes"]
[null,"2006-04-04","5:40PM ",18,69.099999999999994,167.36545514272768,"Short Routes"]
[null,"2006-04-04","5:00PM",26,117.6,378.01976768976294,"Medium Routes"]
[null,"2006-04-06","6:46AM",13,46.6,120.87505093641444,"Short Routes"]
[null,"2006-04-06","11:00AM",4,26.5,49.926618181818185,"Medium Routes"]
[null,"2006-04-06","4:10PM",42,312.7,634.33768636811169,"Medium Routes"]
[null,"2006-04-08","5:14PM",65,242.5,1123.9945308076292,"Medium Routes"]
[null,"2006-04-08","9:06AM",29,106.7,628.8818193810032,"Long Routes"]
[null,"2006-04-08","11:40AM",23,95.9,213.85585934904094,"Short Routes"]
[null,"2006-04-10","7:17PM",29,141.9,501.47448297571151,"Medium Routes"]
[null,"2006-04-10","7:40AM",17,63.8,256.75573019661664,"Medium Routes"]
[null,"2006-04-10","5:30PM",1,1,2.5781369863013697,"Short Routes"]
[null,"2006-04-12","7:24PM",4,22.4,45.14623887760753,"Medium Routes"]
[null,"2006-04-12","4:10PM",3,7.8,19.496683064345621,"Short Routes"]
[null,"2006-04-12","7:28AM",8,26.9,98.293948717948723,"Medium Routes"]
[null,"2006-04-14","4:19PM",21,102.2,330.50313394018207,"Medium Routes"]
[null,"2006-04-14","10:44AM",44,173,760.85783623901057,"Medium Routes"]
[null,"2006-04-14","4:20PM",2,0.6,5.1562739726027393,"Short Routes"]
[null,"2006-04-16","3:55PM",18,64.8,390.34043961579511,"Long Routes"]
[null,"2006-04-16","8:12AM",7,31.6,53.079006243272339,"Short Routes"]
[null,"2006-04-16","2:40PM",16,71.3,148.76929346020239,"Short Routes"]
[null,"2006-04-18","7:40PM",0,0,0,"Short Routes"]
[null,"2006-04-18","7:41AM",22,94.8,319.86288035287635,"Medium Routes"]
[null,"2006-04-18","12:40PM",23,128.9,308.91420222793488,"Medium Routes"]
[null,"2006-04-20","1:01PM",35,229.1,660.21339591526078,"Medium Routes"]
[null,"2006-04-20","6:40AM",5,28.9,61.433717948717955,"Medium Routes"]
[null,"2006-04-20","6:10AM",4,10.7,40.214270270270269,"Medium Routes"]
[null,"2006-04-22","1:10PM",10,34.700000000000003,157.38244473342004,"Medium Routes"]
[null,"2006-04-22","2:11PM",27,231.6,509.30747684891543,"Medium Routes"]
[null,"2006-04-22","5:50PM",0,0,0,"Short Routes"]
[null,"2006-04-24","12:29PM",11,63.7,110.03504830541488,"Medium Routes"]
[null,"2006-04-24","6:28AM",26,182.5,305.29440248517369,"Medium Routes"]
[null,"2006-04-24","7:11AM",34,271.8,492.71936433983552,"Medium Routes"]
[null,"2006-04-26","3:29PM",15,55.8,150.04779314374755,"Medium Routes"]
[null,"2006-04-26","1:47PM",27,182.1,456.00853059087524,"Medium Routes"]
[null,"2006-04-26","12:47PM",15,116.3,253.33807255048623,"Medium Routes"]
[null,"2006-04-28","11:17PM",15,68.900000000000006,178.9198714665616,"Medium Routes"]
[null,"2006-04-28","5:01AM",10,49.9,100.0318620958317,"Medium Routes"]
[null,"2006-04-28","5:21PM",7,60,101.44222206996614,"Medium Routes"]
[null,"2006-04-30","8:44AM",23,116.5,397.72114167039189,"Medium Routes"]
[null,"2006-04-30","9:30AM",1,3,20.156225630252099,"Long Routes"]
[null,"2006-04-30","7:14PM",15,173.7,235.5636405547512,"Medium Routes"]
[null,"2006-05-02","7:08AM",25,178.4,282.16399298504706,"Medium Routes"]
[null,"2006-05-02","9:18AM",29,151,456.40908972691813,"Medium Routes"]
[null,"2006-05-02","8:40AM",15,54,302.34338445378148,"Long Routes"]
[null,"2006-05-04","5:21PM",20,117.2,314.76488946684009,"Medium Routes"]
[null,"2006-05-04","4:30PM",41,222.7,596.10809520308771,"Medium Routes"]
[null,"2006-05-04","2:31PM",24,198.7,452.71775719903599,"Medium Routes"]
[null,"2006-05-06","7:18PM",9,61.1,141.64420026007804,"Medium Routes"]
[null,"2006-05-06","11:40AM",7,30.5,53.079006243272339,"Short Routes"]
[null,"2006-05-06","7:10PM",24,131.6,223.15394019030359,"Short Routes"]
[null,"2006-05-08","7:07AM",46,238.3,997.5366790181431,"Long Routes"]
[null,"2006-05-08","7:10AM",8,36.799999999999997,108.93342646488163,"Medium Routes"]
[null,"2006-05-08","4:11PM",44,379.2,829.98255486489927,"Medium Routes"]
[null,"2006-05-10","9:19AM",48,177.7,1040.9078389754536,"Long Routes"]
[null,"2006-05-10","11:40AM",12,36.1,77.986732257382485,"Short Routes"]
[null,"2006-05-10","11:41AM",22,95.1,371.56250640737983,"Medium Routes"]
[null,"2006-05-12","3:07PM",16,49.5,187.87347845241459,"Medium Routes"]
[null,"2006-05-12","9:10AM",23,113.5,308.91420222793488,"Medium Routes"]
[null,"2006-05-12","5:10PM",42,235.4,634.33768636811169,"Medium Routes"]
[null,"2006-05-14","1:10PM",10,43.3,112.86559719401882,"Medium Routes"]
[null,"2006-05-14","2:14PM",34,128.1,587.93560073014453,"Medium Routes"]
[null,"2006-05-14","4:29PM",14,65.400000000000006,164.38929364586278,"Medium Routes"]
[null,"2006-05-16","7:40AM",9,28.7,87.30778378378379,"Short Routes"]
[null,"2006-05-16","3:40PM",39,160.1,362.62515280924333,"Short Routes"]
[null,"2006-05-16","8:41AM",30,245.7,434.75238029985491,"Medium Routes"]
[null,"2006-05-18","12:18PM",13,44.8,84.485626612164367,"Short Routes"]
[null,"2006-05-18","2:50PM",26,95.5,408.31031029490208,"Medium Routes"]
[null,"2006-05-18","8:40AM",8,36,120.82622597487841,"Medium Routes"]
[null,"2006-05-20","1:37PM",51,279.39999999999998,1105.9645789114195,"Long Routes"]
[null,"2006-05-20","8:50PM",12,52.1,111.57697009515179,"Short Routes"]
[null,"2006-05-20","11:17AM",22,62.4,295.48314995715515,"Medium Routes"]
[null,"2006-05-22","4:29PM",13,51.7,130.0414207245812,"Medium Routes"]
[null,"2006-05-22","7:30PM",1,5.2,12.481654545454546,"Medium Routes"]
[null,"2006-05-22","7:18PM",20,150.9,289.83492019990325,"Medium Routes"]
[null,"2006-05-24","4:40PM",11,89.2,173.12068920676205,"Medium Routes"]
[null,"2006-05-24","5:37AM",20,89.3,433.71159957310567,"Long Routes"]
[null,"2006-05-24","5:20PM",16,75.8,322.49961008403358,"Long Routes"]
[null,"2006-05-26","8:07AM",35,175,758.99529925293496,"Long Routes"]
[null,"2006-05-26","6:22AM",28,169.1,528.17071673220858,"Medium Routes"]
[null,"2006-05-26","10:10AM",12,74.400000000000006,140.90510883931094,"Medium Routes"]
[null,"2006-05-28","7:40PM",12,96.6,226.35887859951799,"Medium Routes"]
[null,"2006-05-28","1:30PM",26,141.5,392.68523441835487,"Medium Routes"]
[null,"2006-05-28","4:40PM",6,1.8,15.468821917808217,"Short Routes"]
[null,"2006-05-30","3:55PM",18,131.9,200.37402995008318,"Medium Routes"]
[null,"2006-05-30","9:50PM",19,132.30000000000001,48.984602739726022,"Short Routes"]
[null,"2006-05-30","9:00PM",1,0.4,2.5781369863013697,"Short Routes"]
[null,"2006-06-01","6:10AM",5,27.7,61.704881016281981,"Medium Routes"]
[null,"2006-06-01","10:30AM",16,55.8,322.49961008403358,"Long Routes"]
[null,"2006-06-01","6:47AM",23,172.5,361.19758218395185,"Medium Routes"]
[null,"2006-06-03","12:53PM",43,163.69999999999999,743.56561268812402,"Medium Routes"]
[null,"2006-06-03","3:40PM",20,50.2,185.96161682525297,"Short Routes"]
[null,"2006-06-03","7:10PM",3,4.3,7.7344109589041086,"Short Routes"]
[null,"2006-06-05","2:10PM",30,192,338.59679158205648,"Medium Routes"]
[null,"2006-06-05","4:35PM",13,55.1,189.00988384488147,"Medium Routes"]
[null,"2006-06-05","3:40PM",37,284.8,581.0569800350529,"Medium Routes"]
[null,"2006-06-07","6:12AM",6,18.899999999999999,58.205189189189191,"Short Routes"]
[null,"2006-06-07","6:00AM",21,111.9,423.28073823529405,"Long Routes"]
[null,"2006-06-07","6:09PM",17,85.4,256.75573019661664,"Medium Routes"]
[null,"2006-06-09","4:19PM",59,364.7,1279.4492187406618,"Long Routes"]
[null,"2006-06-09","3:33PM",31,137.80000000000001,450.71587686087116,"Medium Routes"]
[null,"2006-06-09","7:20PM",7,3.1,18.046958904109587,"Short Routes"]
[null,"2006-06-11","10:40AM",8,41.8,60.661721420882671,"Short Routes"]
[null,"2006-06-11","11:40AM",6,19.399999999999999,38.993366128691243,"Short Routes"]
[null,"2006-06-11","5:40PM",10,71.5,188.63239883293164,"Medium Routes"]
[null,"2006-06-13","5:48AM",1,2.6,6.498894354781874,"Short Routes"]
[null,"2006-06-13","12:03PM",19,46.8,176.66353598399033,"Short Routes"]
[null,"2006-06-13","6:55AM",22,77.400000000000006,332.2721214309156,"Medium Routes"]
[null,"2006-06-15","6:20AM",16,59.7,190.84786289766572,"Medium Routes"]
[null,"2006-06-15","7:46PM",26,101.8,310.12777720870679,"Medium Routes"]
[null,"2006-06-15","11:49AM",40,153.69999999999999,867.42319914621135,"Long Routes"]
[null,"2006-06-17","3:10PM",15,26.4,169.29839579102824,"Medium Routes"]
[null,"2006-06-17","6:05AM",18,54,167.36545514272768,"Short Routes"]
[null,"2006-06-17","8:20AM",21,108.7,317.16884318405585,"Medium Routes"]
[null,"2006-06-19","7:55AM",13,21.7,120.87505093641444,"Short Routes"]
[null,"2006-06-19","12:50PM",25,134.69999999999999,503.90564075630249,"Long Routes"]
[null,"2006-06-19","3:41PM",27,226.7,391.27714226986939,"Medium Routes"]
[null,"2006-06-21","12:40PM",18,70.3,180.05735177249704,"Medium Routes"]
[null,"2006-06-21","9:40AM",17,81.8,158.06737430146504,"Short Routes"]
[null,"2006-06-21","7:30PM",24,93.2,348.94132402131964,"Medium Routes"]
[null,"2006-06-23","12:10PM",30,157.4,408.50034924330612,"Medium Routes"]
[null,"2006-06-23","6:18PM",6,63.2,87.235331005329911,"Medium Routes"]
[null,"2006-06-23","11:37AM",5,17.100000000000001,50.267837837837838,"Medium Routes"]
[null,"2006-06-25","7:07PM",2,2.2999999999999998,15.165430355220668,"Short Routes"]
[null,"2006-06-25","1:18PM",3,10,19.496683064345621,"Short Routes"]
[null,"2006-06-25","2:49PM",16,80,214.89683633247645,"Medium Routes"]
[null,"2006-06-27","9:20PM",12,54.6,77.986732257382485,"Short Routes"]
[null,"2006-06-27","10:10AM",10,41.2,111.318905527824,"Medium Routes"]
[null,"2006-06-27","1:41PM",26,169.7,439.11932575417615,"Medium Routes"]
[null,"2006-06-29","1:51PM",31,127.1,369.76773436422735,"Medium Routes"]
[null,"2006-06-29","5:45AM",20,151.80000000000001,222.53482436565008,"Medium Routes"]
[null,"2006-06-29","8:16AM",10,87.4,144.91746009995163,"Medium Routes"]
[null,"2006-07-01","6:36AM",7,28.9,70.022303467082196,"Medium Routes"]
[null,"2006-07-01","4:02PM",14,39.200000000000003,130.1731317776771,"Short Routes"]
[null,"2006-07-01","4:10PM",12,42.7,133.58268663338879,"Medium Routes"]
[null,"2006-07-03","7:40AM",11,58.8,110.03504830541488,"Medium Routes"]
[null,"2006-07-03","8:04AM",23,64.900000000000006,213.85585934904094,"Short Routes"]
[null,"2006-07-03","8:30AM",15,110.5,218.08832751332477,"Medium Routes"]
[null,"2006-07-05","2:00PM",16,50.9,322.49961008403358,"Long Routes"]
[null,"2006-07-05","4:56AM",16,105.9,241.65245194975682,"Medium Routes"]
[null,"2006-07-05","10:00PM",33,157,85.078520547945203,"Short Routes"]
[null,"2006-07-07","8:44AM",43,200.4,743.56561268812402,"Medium Routes"]
[null,"2006-07-07","10:18AM",16,36.1,103.98230967650998,"Short Routes"]
[null,"2006-07-07","9:10AM",4,13.8,49.146974358974362,"Medium Routes"]
[null,"2006-07-09","1:10PM",14,68.7,188.03473179091691,"Medium Routes"]
[null,"2006-07-09","3:56PM",36,145,543.71801688695291,"Medium Routes"]
[null,"2006-07-09","10:00AM",2,0.5,5.1562739726027393,"Short Routes"]
[null,"2006-07-11","4:10PM",26,183.5,354.03363601086534,"Medium Routes"]
[null,"2006-07-11","1:32PM",32,93.9,297.53858692040478,"Short Routes"]
[null,"2006-07-11","7:40AM",20,90.9,314.08485407300157,"Medium Routes"]
[null,"2006-07-13","5:11AM",7,23.3,151.79905985058699,"Long Routes"]
[null,"2006-07-13","7:10PM",17,73.5,342.65583571428567,"Long Routes"]
[null,"2006-07-13","3:10PM",49,236.9,658.12156126820912,"Medium Routes"]
[null,"2006-07-15","4:48PM",24,93.7,362.04312094117648,"Medium Routes"]
[null,"2006-07-15","6:31AM",6,38.5,66.760447309695024,"Medium Routes"]
[null,"2006-07-15","9:05AM",16,84.8,322.49961008403358,"Long Routes"]
[null,"2006-07-17","7:22AM",19,139.1,211.40808314736756,"Medium Routes"]
[null,"2006-07-17","2:50PM",26,152.9,349.20735904027424,"Medium Routes"]
[null,"2006-07-17","5:08AM",30,210.2,453.09834740579402,"Medium Routes"]
[null,"2006-07-19","6:23AM",20,158.5,222.53482436565008,"Medium Routes"]
[null,"2006-07-19","8:10PM",5,23.4,55.63370609141252,"Medium Routes"]
[null,"2006-07-19","2:17PM",24,172.5,362.47867792463524,"Medium Routes"]
[null,"2006-07-21","5:40PM",12,51,135.4387166328226,"Medium Routes"]
[null,"2006-07-21","8:44AM",50,232.7,864.61117754433019,"Medium Routes"]
[null,"2006-07-21","10:20AM",25,53,335.77630676949445,"Medium Routes"]
[null,"2006-07-23","4:14PM",35,143.6,605.22782428103119,"Medium Routes"]
[null,"2006-07-23","11:10AM",12,73.400000000000006,163.40013969732246,"Medium Routes"]
[null,"2006-07-23","8:10PM",10,53.8,188.63239883293164,"Medium Routes"]
[null,"2006-07-25","5:11PM",27,228.5,424.01455299855212,"Medium Routes"]
[null,"2006-07-25","8:19AM",16,70.099999999999994,214.89683633247645,"Medium Routes"]
[null,"2006-07-25","1:20PM",30,142.69999999999999,453.09834740579402,"Medium Routes"]
[null,"2006-07-27","5:18PM",5,18.100000000000001,32.494471773909368,"Short Routes"]
[null,"2006-07-27","11:26AM",26,130.5,354.03363601086534,"Medium Routes"]
[null,"2006-07-27","2:40PM",25,102.8,232.45202103156623,"Short Routes"]
[null,"2006-07-29","8:17PM",11,46.8,102.27888925388915,"Short Routes"]
[null,"2006-07-29","5:19PM",14,78.900000000000006,172.77366684558956,"Medium Routes"]
[null,"2006-07-29","5:46AM",37,191.8,558.82129513381267,"Medium Routes"]
[null,"2006-07-31","4:50PM",18,47.9,203.15807494923388,"Medium Routes"]
[null,"2006-07-31","3:40PM",20,73,129.97788709563747,"Short Routes"]
[null,"2006-07-31","5:05PM",15,63.3,282.94859824939749,"Medium Routes"]
[null,"2006-08-02","9:37PM",57,294,985.65674240053636,"Medium Routes"]
[null,"2006-08-02","9:51AM",40,136.19999999999999,691.68894203546415,"Medium Routes"]
[null,"2006-08-02","11:41AM",14,110.4,236.44886771378717,"Medium Routes"]
[null,"2006-08-04","8:19PM",6,45,87.235331005329911,"Medium Routes"]
[null,"2006-08-04","2:40PM",19,97.4,382.96828697478986,"Long Routes"]
[null,"2006-08-04","9:40AM",11,54.6,147.74157497857757,"Medium Routes"]
[null,"2006-08-06","7:10AM",13,71.900000000000006,224.79890616152585,"Medium Routes"]
[null,"2006-08-06","9:04AM",15,39.9,139.47121261893975,"Short Routes"]
[null,"2006-08-06","9:25PM",0,0,0,"Short Routes"]
[null,"2006-08-08","10:04AM",26,70.7,241.75010187282888,"Short Routes"]
[null,"2006-08-08","8:10AM",12,39,111.57697009515179,"Short Routes"]
[null,"2006-08-08","8:17AM",50,288.60000000000002,755.1639123429901,"Medium Routes"]
[null,"2006-08-10","8:49PM",5,19.3,56.432798597009409,"Medium Routes"]
[null,"2006-08-10","7:40AM",18,83.3,180.05735177249704,"Medium Routes"]
[null,"2006-08-10","5:32PM",1,4.8,12.28674358974359,"Medium Routes"]
[null,"2006-08-12","10:22AM",12,52,188.85893368010403,"Medium Routes"]
[null,"2006-08-12","8:10PM",16,40.1,148.76929346020239,"Short Routes"]
[null,"2006-08-12","12:40PM",17,66.3,228.32788860325624,"Medium Routes"]
[null,"2006-08-14","7:21AM",23,141,313.18360108653468,"Medium Routes"]
[null,"2006-08-14","7:16AM",20,78.400000000000006,185.96161682525297,"Short Routes"]
[null,"2006-08-14","2:48PM",43,323.89999999999998,726.23580797806051,"Medium Routes"]
[null,"2006-08-16","12:21PM",28,80.2,333.98376007091503,"Medium Routes"]
[null,"2006-08-16","7:23AM",27,73.400000000000006,466.8900358739383,"Medium Routes"]
[null,"2006-08-16","11:02AM",6,15,74.889927272727277,"Medium Routes"]
[null,"2006-08-18","4:38PM",15,58.3,166.90111827423755,"Medium Routes"]
[null,"2006-08-18","1:37PM",7,29,82.194646822931389,"Medium Routes"]
[null,"2006-08-18","2:40PM",50,311.7,755.1639123429901,"Medium Routes"]
[null,"2006-08-20","1:18PM",9,19.399999999999999,58.490049193036867,"Short Routes"]
[null,"2006-08-20","10:49AM",11,37.799999999999997,147.74157497857757,"Medium Routes"]
[null,"2006-08-20","6:32AM",36,162.1,543.71801688695291,"Medium Routes"]
[null,"2006-08-22","5:40AM",7,33.5,53.079006243272339,"Short Routes"]
[null,"2006-08-22","8:40AM",13,74.8,152.64720124258685,"Medium Routes"]
[null,"2006-08-22","7:30PM",7,3.2,18.046958904109587,"Short Routes"]
[null,"2006-08-24","8:51AM",58,251.2,1002.948965951423,"Medium Routes"]
[null,"2006-08-24","1:10PM",18,100.5,200.37402995008318,"Medium Routes"]
[null,"2006-08-24","5:21AM",13,92.6,219.55966287708807,"Medium Routes"]
[null,"2006-08-26","12:44PM",71,374.6,1227.7478721129489,"Medium Routes"]
[null,"2006-08-26","8:24AM",18,91.3,245.10020954598369,"Medium Routes"]
[null,"2006-08-26","3:50PM",7,5.2,18.046958904109587,"Short Routes"]
[null,"2006-08-28","5:10PM",8,28,89.055124422259198,"Medium Routes"]
[null,"2006-08-28","5:58AM",20,155.19999999999999,314.08485407300157,"Medium Routes"]
[null,"2006-08-28","8:07AM",30,180.6,352.26277209827737,"Medium Routes"]
[null,"2006-08-30","4:52PM",28,91.1,333.98376007091503,"Medium Routes"]
[null,"2006-08-30","9:05PM",54,228.9,1171.0213188473854,"Long Routes"]
[null,"2006-08-30","12:00PM",3,0.9,7.7344109589041086,"Short Routes"]
[null,"2006-09-01","5:55AM",41,220.7,618.49033160784313,"Medium Routes"]
[null,"2006-09-01","7:03PM",23,194,433.85451731574278,"Medium Routes"]
[null,"2006-09-01","9:11PM",10,75,157.04242703650078,"Medium Routes"]
[null,"2006-09-03","11:10AM",3,8.4,33.859679158205651,"Medium Routes"]
[null,"2006-09-03","4:56PM",14,78.5,130.1731317776771,"Short Routes"]
[null,"2006-09-03","8:10PM",8,30.3,74.384646730101196,"Short Routes"]
[null,"2006-09-05","11:13AM",26,119.5,392.21338101960782,"Medium Routes"]
[null,"2006-09-05","5:18AM",6,29.3,73.720461538461535,"Medium Routes"]
[null,"2006-09-05","4:08PM",38,124.7,573.92457338067243,"Medium Routes"]
[null,"2006-09-07","7:42PM",33,131.69999999999999,393.62371722643553,"Medium Routes"]
[null,"2006-09-07","6:06AM",12,47,226.35887859951799,"Medium Routes"]
[null,"2006-09-07","2:49PM",23,117.9,283.84245267489712,"Medium Routes"]
[null,"2006-09-09","9:46AM",20,76.7,238.55982862208214,"Medium Routes"]
[null,"2006-09-09","10:06AM",18,81.7,390.34043961579511,"Long Routes"]
[null,"2006-09-09","8:19AM",9,64.3,111.06878582930756,"Medium Routes"]
[null,"2006-09-11","7:24PM",10,59.7,112.86559719401882,"Medium Routes"]
[null,"2006-09-11","7:55AM",60,203.7,905.10780235294112,"Medium Routes"]
[null,"2006-09-11","9:03AM",8,22.6,98.293948717948723,"Medium Routes"]
[null,"2006-09-13","6:47AM",20,144.30000000000001,289.83492019990325,"Medium Routes"]
[null,"2006-09-13","9:18AM",20,54.3,289.83492019990325,"Medium Routes"]
[null,"2006-09-13","6:11PM",29,183,489.78694026427343,"Medium Routes"]
[null,"2006-09-15","7:26AM",6,21.7,73.720461538461535,"Medium Routes"]
[null,"2006-09-15","2:53PM",34,185.9,456.65577720651248,"Medium Routes"]
[null,"2006-09-15","10:50AM",14,52,188.03473179091691,"Medium Routes"]
[null,"2006-09-17","10:50AM",13,70.2,196.10669050980391,"Medium Routes"]
[null,"2006-09-17","8:23AM",18,65.8,311.26002391595887,"Medium Routes"]
[null,"2006-09-17","11:04AM",5,11,46.490404206313244,"Short Routes"]
[null,"2006-09-19","8:37PM",29,137.30000000000001,628.8818193810032,"Long Routes"]
[null,"2006-09-19","8:49AM",19,103.7,255.18999314481579,"Medium Routes"]
[null,"2006-09-19","7:25AM",42,199.8,634.33768636811169,"Medium Routes"]
[null,"2006-09-21","4:48PM",5,6.2,37.913575888051668,"Short Routes"]
[null,"2006-09-21","11:40AM",15,86.9,201.46578406169667,"Medium Routes"]
[null,"2006-09-21","12:37PM",9,32,90.482108108108108,"Medium Routes"]
[null,"2006-09-23","5:40PM",4,21,30.330860710441335,"Short Routes"]
[null,"2006-09-23","4:40PM",16,109.2,251.26788325840127,"Medium Routes"]
[null,"2006-09-23","6:20PM",30,205.4,453.09834740579402,"Medium Routes"]
[null,"2006-09-25","7:10AM",2,9.4,19.40172972972973,"Short Routes"]
[null,"2006-09-25","8:40PM",6,23.9,55.788485047575897,"Short Routes"]
[null,"2006-09-25","9:20PM",3,4,7.7344109589041086,"Short Routes"]
[null,"2006-09-27","9:21AM",44,165.8,760.85783623901057,"Medium Routes"]
[null,"2006-09-27","6:19PM",11,101,185.78125320368991,"Medium Routes"]
[null,"2006-09-27","6:41AM",34,271,574.23296444776884,"Medium Routes"]
[null,"2006-09-29","8:19PM",23,95.8,334.40210218709797,"Medium Routes"]
[null,"2006-09-29","10:33PM",11,105.1,207.49563871622482,"Medium Routes"]
[null,"2006-09-29","10:00AM",55,316.89999999999998,830.68030357728912,"Medium Routes"]
[null,"2006-10-01","5:40PM",16,31.2,214.89683633247645,"Medium Routes"]
[null,"2006-10-01","5:00PM",0,0,0,"Short Routes"]
[null,"2006-10-01","9:40PM",0,0,0,"Short Routes"]
[null,"2006-10-03","12:10PM",22,108.1,244.78830680221509,"Medium Routes"]
[null,"2006-10-03","9:10AM",10,52.1,111.26741218282504,"Medium Routes"]
[null,"2006-10-03","4:20PM",60,208.7,906.19669481158803,"Medium Routes"]
[null,"2006-10-05","7:10PM",12,57.9,111.57697009515179,"Short Routes"]
[null,"2006-10-05","5:40AM",7,44.2,65.08656588883855,"Short Routes"]
[null,"2006-10-05","7:17AM",4,4.5999999999999996,12.549677419354838,"Short Routes"]
[null,"2006-10-07","11:10AM",11,42.3,173.12068920676205,"Medium Routes"]
[null,"2006-10-07","11:17AM",31,103.8,416.36262039417312,"Medium Routes"]
[null,"2006-10-07","1:49PM",5,3.9,15.687096774193547,"Short Routes"]
[null,"2006-10-09","11:10AM",21,100.1,330.50313394018207,"Medium Routes"]
[null,"2006-10-09","9:20AM",10,24.3,201.56225630252098,"Long Routes"]
[null,"2006-10-09","8:14PM",14,55.7,188.03473179091691,"Medium Routes"]
[null,"2006-10-11","5:10AM",18,191.7,203.15807494923388,"Medium Routes"]
[null,"2006-10-11","8:28PM",5,21.1,78.691222366710022,"Medium Routes"]
[null,"2006-10-11","5:20PM",10,31.6,64.988943547818735,"Short Routes"]
[null,"2006-10-13","5:47PM",17,73.599999999999994,202.77585432876984,"Medium Routes"]
[null,"2006-10-13","7:58AM",15,50.9,145.51297297297299,"Short Routes"]
[null,"2006-10-13","7:01AM",27,190.2,456.00853059087524,"Medium Routes"]
[null,"2006-10-15","10:05AM",39,256,845.73761916755609,"Long Routes"]
[null,"2006-10-15","11:19AM",8,26.2,107.44841816623823,"Medium Routes"]
[null,"2006-10-15","5:30PM",5,1.8,12.890684931506849,"Short Routes"]
[null,"2006-10-17","8:29PM",49,240.9,1062.593418954109,"Long Routes"]
[null,"2006-10-17","5:40PM",8,38.1,80.025489676665359,"Medium Routes"]
[null,"2006-10-17","3:57PM",5,10.9,50.267837837837838,"Medium Routes"]
[null,"2006-10-19","2:00PM",15,66.099999999999994,302.34338445378148,"Long Routes"]
[null,"2006-10-19","12:02PM",5,6.1,15.687096774193547,"Short Routes"]
[null,"2006-10-19","4:10PM",3,1.9,7.7344109589041086,"Short Routes"]
[null,"2006-10-21","10:04AM",8,37.700000000000003,90.29247775521506,"Medium Routes"]
[null,"2006-10-21","4:35PM",16,48.1,232.62754934754642,"Medium Routes"]
[null,"2006-10-21","2:15PM",30,130,453.09834740579402,"Medium Routes"]
[null,"2006-10-23","1:51PM",20,76.599999999999994,238.55982862208214,"Medium Routes"]
[null,"2006-10-23","4:56AM",36,256.7,543.71801688695291,"Medium Routes"]
[null,"2006-10-23","3:19PM",3,2.7,9.4122580645161289,"Short Routes"]
[null,"2006-10-25","8:19AM",42,230.6,661.00626788036413,"Medium Routes"]
[null,"2006-10-25","5:01PM",7,59,118.22443385689358,"Medium Routes"]
[null,"2006-10-25","9:20PM",2,1.4,5.1562739726027393,"Short Routes"]
[null,"2006-10-27","5:40AM",19,122.9,299.02664499349805,"Medium Routes"]
[null,"2006-10-27","7:23PM",18,60.9,261.70599301598975,"Medium Routes"]
[null,"2006-10-27","2:15PM",11,39.1,137.29820000000001,"Medium Routes"]
[null,"2006-10-29","5:10PM",13,67.900000000000006,146.72527635222448,"Medium Routes"]
[null,"2006-10-29","10:32AM",8,34.700000000000003,74.384646730101196,"Short Routes"]
[null,"2006-10-29","8:10AM",12,103.3,140.90510883931094,"Medium Routes"]
[null,"2006-10-31","5:25AM",4,18.2,30.330860710441335,"Short Routes"]
[null,"2006-10-31","1:30PM",7,25.3,70.374972972972969,"Medium Routes"]
[null,"2006-10-31","9:40PM",0,0,0,"Short Routes"]
[null,"2006-11-02","9:40AM",11,52.8,110.03504830541488,"Medium Routes"]
[null,"2006-11-02","8:40AM",9,36.5,90.028675886248521,"Medium Routes"]
[null,"2006-11-02","7:23AM",5,30.8,50.267837837837838,"Medium Routes"]
[null,"2006-11-04","2:40PM",12,41,135.4387166328226,"Medium Routes"]
[null,"2006-11-04","11:10AM",2,8.4,22.263781105564799,"Medium Routes"]
[null,"2006-11-04","7:29PM",4,31.2,57.966984039980652,"Medium Routes"]
[null,"2006-11-06","7:10PM",18,113.3,200.28134192908507,"Medium Routes"]
[null,"2006-11-06","3:00PM",87,477.7,1313.9852074768028,"Medium Routes"]
[null,"2006-11-06","4:40PM",1,1.1000000000000001,2.5781369863013697,"Short Routes"]
[null,"2006-11-08","1:44PM",37,145.19999999999999,639.81227138280428,"Medium Routes"]
[null,"2006-11-08","8:17AM",10,42.3,122.86743589743591,"Medium Routes"]
[null,"2006-11-08","11:20AM",23,85.3,308.91420222793488,"Medium Routes"]
[null,"2006-11-10","1:04PM",17,58.4,158.06737430146504,"Short Routes"]
[null,"2006-11-10","6:11PM",10,73.8,188.63239883293164,"Medium Routes"]
[null,"2006-11-10","11:40AM",26,124.2,392.68523441835487,"Medium Routes"]
[null,"2006-11-12","7:46PM",16,75.3,190.84786289766572,"Medium Routes"]
[null,"2006-11-12","7:03PM",15,162.6,282.94859824939749,"Medium Routes"]
[null,"2006-11-12","10:20AM",1,0.5,2.5781369863013697,"Short Routes"]
[null,"2006-11-14","9:30AM",39,123.6,567.02965153464436,"Medium Routes"]
[null,"2006-11-14","5:25PM",15,37.299999999999997,176.13138604913868,"Medium Routes"]
[null,"2006-11-14","7:50AM",25,88.4,335.77630676949445,"Medium Routes"]
[null,"2006-11-16","5:40PM",7,37.1,86.38683342279478,"Medium Routes"]
[null,"2006-11-16","6:57AM",14,43.5,174.74316363636365,"Medium Routes"]
[null,"2006-11-16","3:10PM",3,1.8,7.7344109589041086,"Short Routes"]
[null,"2006-11-18","7:10AM",31,139,536.05893007748477,"Medium Routes"]
[null,"2006-11-18","2:18PM",9,19.8,58.490049193036867,"Short Routes"]
[null,"2006-11-18","11:00AM",2,2.2000000000000002,5.1562739726027393,"Short Routes"]
[null,"2006-11-20","2:38PM",76,264.3,1648.1040783778017,"Long Routes"]
[null,"2006-11-20","4:26PM",25,195.7,422.23012091747705,"Medium Routes"]
[null,"2006-11-20","1:27PM",5,7.3,50.267837837837838,"Medium Routes"]
[null,"2006-11-22","6:04AM",14,43,130.1731317776771,"Short Routes"]
[null,"2006-11-22","2:41PM",29,65.5,421.63743319242786,"Medium Routes"]
[null,"2006-11-22","12:20PM",28,162.5,422.89179091207444,"Medium Routes"]
[null,"2006-11-24","6:20AM",19,141.80000000000001,299.02664499349805,"Medium Routes"]
[null,"2006-11-24","12:41PM",23,153.80000000000001,388.45171124407892,"Medium Routes"]
[null,"2006-11-24","5:47PM",9,10.1,28.236774193548385,"Short Routes"]
[null,"2006-11-26","9:10AM",10,54.2,134.31052270779779,"Medium Routes"]
[null,"2006-11-26","6:32AM",42,245.8,634.33768636811169,"Medium Routes"]
[null,"2006-11-26","10:00PM",0,0,0,"Short Routes"]
[null,"2006-11-28","8:40AM",20,116.7,246.81952406512792,"Medium Routes"]
[null,"2006-11-28","2:10PM",17,88,199.61557085569049,"Medium Routes"]
[null,"2006-11-28","6:55AM",20,93.4,302.06556493719603,"Medium Routes"]
[null,"2006-11-30","5:10AM",2,15,27.233356616220409,"Medium Routes"]
[null,"2006-11-30","8:14PM",12,49.1,161.17262724935733,"Medium Routes"]
[null,"2006-11-30","6:50PM",3,0.5,7.7344109589041086,"Short Routes"]
[null,"2006-12-02","7:10PM",21,125.2,330.50313394018207,"Medium Routes"]
[null,"2006-12-02","6:14AM",49,267.2,847.31895399344353,"Medium Routes"]
[null,"2006-12-02","3:58PM",14,85.3,236.44886771378717,"Medium Routes"]
[null,"2006-12-04","12:40PM",19,98.4,298.38061136935153,"Medium Routes"]
[null,"2006-12-04","3:15PM",23,155.9,333.31015822988877,"Medium Routes"]
[null,"2006-12-04","10:00AM",45,215.6,679.64752110869108,"Medium Routes"]
[null,"2006-12-05","6:30AM",7,30.4,67.906054054054053,"Short Routes"]
[null,"2006-12-05","8:17AM",43,314.2,649.44096461497145,"Medium Routes"]
[null,"2006-12-05","4:55PM",40,155.80000000000001,604.13112987439206,"Medium Routes"]
[null,"2006-12-06","5:28PM",25,90.4,377.12825098039218,"Medium Routes"]
[null,"2006-12-06","2:50PM",14,53.3,106.15801248654468,"Short Routes"]
[null,"2006-12-06","2:00PM",46,133.69999999999999,694.75079935555084,"Medium Routes"]
[null,"2006-12-08","10:10AM",6,20,67.719358316411302,"Medium Routes"]
[null,"2006-12-08","1:32PM",7,30.1,87.371581818181824,"Medium Routes"]
[null,"2006-12-08","3:10PM",37,200.1,496.94893401885179,"Medium Routes"]
[null,"2006-12-10","9:40AM",45,361.6,848.84579474819247,"Medium Routes"]
[null,"2006-12-10","6:40PM",7,22.7,94.017365895458454,"Medium Routes"]
[null,"2006-12-10","6:00PM",0,0,0,"Short Routes"]
[null,"2006-12-12","5:44AM",30,99.9,518.76670652659811,"Medium Routes"]
[null,"2006-12-12","5:32AM",10,45.9,100.0318620958317,"Medium Routes"]
[null,"2006-12-12","5:11PM",32,183.1,603.62367626538128,"Medium Routes"]
[null,"2006-12-13","4:40PM",12,42.2,181.02156047058824,"Medium Routes"]
[null,"2006-12-13","8:11AM",35,256.3,660.21339591526078,"Medium Routes"]
[null,"2006-12-13","2:50PM",11,38.700000000000003,147.74157497857757,"Medium Routes"]
[null,"2006-12-14","1:38PM",57,263,1236.0780587833513,"Long Routes"]
[null,"2006-12-14","7:10PM",20,130.19999999999999,302.06556493719603,"Medium Routes"]
[null,"2006-12-14","6:30PM",29,169.2,437.99506915893426,"Medium Routes"]
[null,"2006-12-16","6:44PM",9,33.1,101.57903747461694,"Medium Routes"]
[null,"2006-12-16","7:11PM",21,125.6,396.12803754915649,"Medium Routes"]
[null,"2006-12-16","1:28PM",17,72.400000000000006,189.15460071080258,"Medium Routes"]
[null,"2006-12-18","12:49PM",49,240.3,1062.593418954109,"Long Routes"]
[null,"2006-12-18","5:50AM",46,238.8,997.5366790181431,"Long Routes"]
[null,"2006-12-18","5:06AM",15,82.1,282.94859824939749,"Medium Routes"]
[null,"2006-12-20","10:11AM",38,294.8,716.80311556514027,"Medium Routes"]
[null,"2006-12-20","12:07PM",23,102.1,270.06812527534595,"Medium Routes"]
[null,"2006-12-20","4:00PM",1,1.2,2.5781369863013697,"Short Routes"]
[null,"2006-12-22","9:40AM",10,18.100000000000001,112.86559719401882,"Medium Routes"]
[null,"2006-12-22","11:44AM",58,238.8,1002.948965951423,"Medium Routes"]
[null,"2006-12-22","8:07AM",21,94.8,246.58394046879414,"Medium Routes"]
[null,"2006-12-24","8:53PM",2,9.4,22.573119438803765,"Medium Routes"]
[null,"2006-12-24","11:10AM",14,48.2,190.63349631354285,"Medium Routes"]
[null,"2006-12-24","8:00PM",3,0.9,7.7344109589041086,"Short Routes"]
[null,"2006-12-26","4:48AM",6,38.9,71.567948586624652,"Medium Routes"]
[null,"2006-12-26","5:40PM",7,36.6,70.022303467082196,"Medium Routes"]
[null,"2006-12-28","8:26AM",21,127.3,285.95024447031432,"Medium Routes"]
[null,"2006-12-28","6:40PM",14,76.2,188.03473179091691,"Medium Routes"]
[null,"2006-12-28","11:45PM",48,341.5,724.95735584927047,"Medium Routes"]
[null,"2006-12-30","3:11PM",43,322.89999999999998,811.11931498160607,"Medium Routes"]
[null,"2006-12-30","5:52PM",23,191.2,333.31015822988877,"Medium Routes"]
[null,"2006-12-30","10:40AM",11,64,147.74157497857757,"Medium Routes"]

{"sheet":"SAMPLING PLANS","index":2,"n_rows":60,"n_cols":17,"rows_kept":60,"cut":false,"hidden":false,"merged":[[1,1,1,15],[45,1,45,15],[59,1,59,15],[41,1,41,15],[33,1,33,15],[55,1,55,15],[57,1,57,15],[5,4,6,4],[5,3,6,3],[4,3,4,4],[4,5,4,15],[5,5,5,14],[5,15,6,15]]}
[1.25,"Sampling Plans"]
[null,"Once you've completed the INPUT tab, your options for a Sampling Plan will appear here. You can choose to select samples annually, quarterly, monthly, or weekly (sections 1, 2, 3, 4). Within these sections, look at row a) if 100% count of UPT is not available, and row b) if 100% count of UPT is available. Look at row c) if you use the uncommon PPMT Option. If you do not use route grouping, your required sample in each period will be in column D, Sample Size by Period. If you use route grouping, your required sample in each period will be in columns F-O, Sample Size by Period and by Group (depending on how many groups you use)."]
[null,"A. Sample Size by Options"]
[]
[null,null,null,"Without Grouping",null,"With Grouping"]
[null,null,null,"Sample Size by Period","Annual Sample Size","Sample Size by Period and by Group",null,null,null,null,null,null,null,null,null,"Annual Sample Size"]
[null," ",null,null,null,{"$f":"+IF(CALCULATIONS!E8=\" \",\" \",INPUT!D33)","v":"Short Routes"},{"$f":"+IF(CALCULATIONS!F8=\" \",\" \",INPUT!E33)","v":"Medium Routes"},{"$f":"+IF(CALCULATIONS!G8=\" \",\" \",INPUT!F33)","v":"Long Routes"},{"$f":"+IF(CALCULATIONS!H8=\" \",\" \",INPUT!G33)","v":" "},{"$f":"+IF(CALCULATIONS!I8=\" \",\" \",INPUT!H33)","v":" "},{"$f":"+IF(CALCULATIONS!J8=\" \",\" \",INPUT!I33)","v":" "},{"$f":"+IF(CALCULATIONS!K8=\" \",\" \",INPUT!J33)","v":" "},{"$f":"+IF(CALCULATIONS!L8=\" \",\" \",INPUT!K33)","v":" "},{"$f":"+IF(CALCULATIONS!M8=\" \",\" \",INPUT!L33)","v":" "},{"$f":"+IF(CALCULATIONS!N8=\" \",\" \",INPUT!M33)","v":" "},null,"All"]
[]
[null,"1. Annual Frequency",1]
[null,"    a) 100% UPT Not Available",null,{"$f":"+IF(CALCULATIONS!D19=\" \",\" \",ROUNDUP(A1*(CALCULATIONS!D19*1.96/0.1)^2,0))","v":348},{"$f":"+IF(D10=\" \",\" \",D10)","v":348},{"$f":"+IF(OR(SUM(PMT)=0,SUM(SizeActual)=0,SUM(SizeExpected)=0,CALCULATIONS!E$8=\" \"),\" \",MAX(10,ROUNDUP(INPUT!D$39/INPUT!$N$39*$Q10,0)))","v":68},{"$f":"+IF(OR(SUM(PMT)=0,SUM(SizeActual)=0,SUM(SizeExpected)=0,CALCULATIONS!F$8=\" \"),\" \",MAX(10,ROUNDUP(INPUT!E$39/INPUT!$N$39*$Q10,0)))","v":205},{"$f":"+IF(OR(SUM(PMT)=0,SUM(SizeActual)=0,SUM(SizeExpected)=0,CALCULATIONS!G$8=\" \"),\" \",MAX(10,ROUNDUP(INPUT!F$39/INPUT!$N$39*$Q10,0)))","v":22},{"$f":"+IF(OR(SUM(PMT)=0,SUM(SizeActual)=0,SUM(SizeExpected)=0,CALCULATIONS!H$8=\" \"),\" \",MAX(10,ROUNDUP(INPUT!G$39/INPUT!$N$39*$Q10,0)))","v":" "},{"$f":"+IF(OR(SUM(PMT)=0,SUM(SizeActual)=0,SUM(SizeExpected)=0,CALCULATIONS!I$8=\" \"),\" \",MAX(10,ROUNDUP(INPUT!H$39/INPUT!$N$39*$Q10,0)))","v":" "},{"$f":"+IF(OR(SUM(PMT)=0,SUM(SizeActual)=0,SUM(SizeExpected)=0,CALCULATIONS!J$8=\" \"),\" \",MAX(10,ROUNDUP(INPUT!I$39/INPUT!$N$39*$Q10,0)))","v":" "},{"$f":"+IF(OR(SUM(PMT)=0,SUM(SizeActual)=0,SUM(SizeExpected)=0,CALCULATIONS!K$8=\" \"),\" \",MAX(10,ROUNDUP(INPUT!J$39/INPUT!$N$39*$Q10,0)))","v":" "},{"$f":"+IF(OR(SUM(PMT)=0,SUM(SizeActual)=0,SUM(SizeExpected)=0,CALCULATIONS!L$8=\" \"),\" \",MAX(10,ROUNDUP(INPUT!K$39/INPUT!$N$39*$Q10,0)))","v":" "},{"$f":"+IF(OR(SUM(PMT)=0,SUM(SizeActual)=0,SUM(SizeExpected)=0,CALCULATIONS!M$8=\" \"),\" \",MAX(10,ROUNDUP(INPUT!L$39/INPUT!$N$39*$Q10,0)))","v":" "},{"$f":"+IF(OR(SUM(PMT)=0,SUM(SizeActual)=0,SUM(SizeExpected)=0,CALCULATIONS!N$8=\" \"),\" \",MAX(10,ROUNDUP(INPUT!M$39/INPUT!$N$39*$Q10,0)))","v":" "},{"$f":"+IF(SUM(F10:O10)=0,\" \",SUM(F10:O10))","v":295},{"$f":"+IF(CALCULATIONS!O19=\" \",\" \",ROUNDUP(A1*(CALCULATIONS!O19*1.96/0.1)^2,0))","v":294}]
[null,"    b) 100% UPT Available",null,{"$f":"+IF(CALCULATIONS!D21=\" \",\" \",ROUNDUP(A1*(CALCULATIONS!D21*1.96/0.1)^2,0))","v":70},{"$f":"+IF(D11=\" \",\" \",D11)","v":70},{"$f":"+IF(OR(SUM(UPT)=0,SUM(PMT)=0,SUM(SizeActual)=0,SUM(SizeExpected)=0,CALCULATIONS!E$8=\" \"),\" \",IF(INPUT!$M52=0,ROUNDUP(INPUT!D$39/INPUT!$N$39*$Q11,0),MAX(10,ROUNDUP(INPUT!D$39/INPUT!$N$39*$Q11,0))))","v":15},{"$f":"+IF(OR(SUM(UPT)=0,SUM(PMT)=0,SUM(SizeActual)=0,SUM(SizeExpected)=0,CALCULATIONS!F$8=\" \"),\" \",IF(INPUT!$M52=0,ROUNDUP(INPUT!E$39/INPUT!$N$39*$Q11,0),MAX(10,ROUNDUP(INPUT!E$39/INPUT!$N$39*$Q11,0))))","v":46},{"$f":"+IF(OR(SUM(UPT)=0,SUM(PMT)=0,SUM(SizeActual)=0,SUM(SizeExpected)=0,CALCULATIONS!G$8=\" \"),\" \",IF(INPUT!$M52=0,ROUNDUP(INPUT!F$39/INPUT!$N$39*$Q11,0),MAX(10,ROUNDUP(INPUT!F$39/INPUT!$N$39*$Q11,0))))","v":10},{"$f":"+IF(OR(SUM(UPT)=0,SUM(PMT)=0,SUM(SizeActual)=0,SUM(SizeExpected)=0,CALCULATIONS!H$8=\" \"),\" \",IF(INPUT!$M52=0,ROUNDUP(INPUT!G$39/INPUT!$N$39*$Q11,0),MAX(10,ROUNDUP(INPUT!G$39/INPUT!$N$39*$Q11,0))))","v":" "},{"$f":"+IF(OR(SUM(UPT)=0,SUM(PMT)=0,SUM(SizeActual)=0,SUM(SizeExpected)=0,CALCULATIONS!I$8=\" \"),\" \",IF(INPUT!$M52=0,ROUNDUP(INPUT!H$39/INPUT!$N$39*$Q11,0),MAX(10,ROUNDUP(INPUT!H$39/INPUT!$N$39*$Q11,0))))","v":" "},{"$f":"+IF(OR(SUM(UPT)=0,SUM(PMT)=0,SUM(SizeActual)=0,SUM(SizeExpected)=0,CALCULATIONS!J$8=\" \"),\" \",IF(INPUT!$M52=0,ROUNDUP(INPUT!I$39/INPUT!$N$39*$Q11,0),MAX(10,ROUNDUP(INPUT!I$39/INPUT!$N$39*$Q11,0))))","v":" "},{"$f":"+IF(OR(SUM(UPT)=0,SUM(PMT)=0,SUM(SizeActual)=0,SUM(SizeExpected)=0,CALCULATIONS!K$8=\" \"),\" \",IF(INPUT!$M52=0,ROUNDUP(INPUT!J$39/INPUT!$N$39*$Q11,0),MAX(10,ROUNDUP(INPUT!J$39/INPUT!$N$39*$Q11,0))))","v":" "},{"$f":"+IF(OR(SUM(UPT)=0,SUM(PMT)=0,SUM(SizeActual)=0,SUM(SizeExpected)=0,CALCULATIONS!L$8=\" \"),\" \",IF(INPUT!$M52=0,ROUNDUP(INPUT!K$39/INPUT!$N$39*$Q11,0),MAX(10,ROUNDUP(INPUT!K$39/INPUT!$N$39*$Q11,0))))","v":" "},{"$f":"+IF(OR(SUM(UPT)=0,SUM(PMT)=0,SUM(SizeActual)=0,SUM(SizeExpected)=0,CALCULATIONS!M$8=\" \"),\" \",IF(INPUT!$M52=0,ROUNDUP(INPUT!L$39/INPUT!$N$39*$Q11,0),MAX(10,ROUNDUP(INPUT!L$39/INPUT!$N$39*$Q11,0))))","v":" "},{"$f":"+IF(OR(SUM(UPT)=0,SUM(PMT)=0,SUM(SizeActual)=0,SUM(SizeExpected)=0,CALCULATIONS!N$8=\" \"),\" \",IF(INPUT!$M52=0,ROUNDUP(INPUT!M$39/INPUT!$N$39*$Q11,0),MAX(10,ROUNDUP(INPUT!M$39/INPUT!$N$39*$Q11,0))))","v":" "},{"$f":"+IF(SUM(F11:O11)=0,\" \",SUM(F11:O11))","v":71},{"$f":"+IF(AND(CALCULATIONS!O21=\" \",CALCULATIONS!O22=\" \"),\" \",IF(INPUT!M52=1,ROUNDUP(A1*(CALCULATIONS!O21*1.96/0.1)^2,0),ROUNDUP(A1*(CALCULATIONS!O22*1.96/0.1)^2,0)))","v":65}]
[null,"    c) PPMT Option",null,{"$f":"+IF(CALCULATIONS!D23=\" \",\" \",ROUNDUP(A1*(CALCULATIONS!D23*1.96/0.1)^2,0))","v":117},{"$f":"+IF(D12=\" \",\" \",D12)","v":117},{"$f":"+IF(OR(SUM(PMT)=0,SUM(PPMT)=0,SUM(SizeActual)=0,SUM(SizeExpected)=0,CALCULATIONS!E$8=\" \"),\" \",MAX(10,ROUNDUP(INPUT!D$39/INPUT!$N$39*$Q12,0)))","v":17},{"$f":"+IF(OR(SUM(PMT)=0,SUM(PPMT)=0,SUM(SizeActual)=0,SUM(SizeExpected)=0,CALCULATIONS!F$8=\" \"),\" \",MAX(10,ROUNDUP(INPUT!E$39/INPUT!$N$39*$Q12,0)))","v":51},{"$f":"+IF(OR(SUM(PMT)=0,SUM(PPMT)=0,SUM(SizeActual)=0,SUM(SizeExpected)=0,CALCULATIONS!G$8=\" \"),\" \",MAX(10,ROUNDUP(INPUT!F$39/INPUT!$N$39*$Q12,0)))","v":10},{"$f":"+IF(OR(SUM(PMT)=0,SUM(PPMT)=0,SUM(SizeActual)=0,SUM(SizeExpected)=0,CALCULATIONS!H$8=\" \"),\" \",MAX(10,ROUNDUP(INPUT!G$39/INPUT!$N$39*$Q12,0)))","v":" "},{"$f":"+IF(OR(SUM(PMT)=0,SUM(PPMT)=0,SUM(SizeActual)=0,SUM(SizeExpected)=0,CALCULATIONS!I$8=\" \"),\" \",MAX(10,ROUNDUP(INPUT!H$39/INPUT!$N$39*$Q12,0)))","v":" "},{"$f":"+IF(OR(SUM(PMT)=0,SUM(PPMT)=0,SUM(SizeActual)=0,SUM(SizeExpected)=0,CALCULATIONS!J$8=\" \"),\" \",MAX(10,ROUNDUP(INPUT!I$39/INPUT!$N$39*$Q12,0)))","v":" "},{"$f":"+IF(OR(SUM(PMT)=0,SUM(PPMT)=0,SUM(SizeActual)=0,SUM(SizeExpected)=0,CALCULATIONS!K$8=\" \"),\" \",MAX(10,ROUNDUP(INPUT!J$39/INPUT!$N$39*$Q12,0)))","v":" "},{"$f":"+IF(OR(SUM(PMT)=0,SUM(PPMT)=0,SUM(SizeActual)=0,SUM(SizeExpected)=0,CALCULATIONS!L$8=\" \"),\" \",MAX(10,ROUNDUP(INPUT!K$39/INPUT!$N$39*$Q12,0)))","v":" "},{"$f":"+IF(OR(SUM(PMT)=0,SUM(PPMT)=0,SUM(SizeActual)=0,SUM(SizeExpected)=0,CALCULATIONS!M$8=\" \"),\" \",MAX(10,ROUNDUP(INPUT!L$39/INPUT!$N$39*$Q12,0)))","v":" "},{"$f":"+IF(OR(SUM(PMT)=0,SUM(PPMT)=0,SUM(SizeActual)=0,SUM(SizeExpected)=0,CALCULATIONS!N$8=\" \"),\" \",MAX(10,ROUNDUP(INPUT!M$39/INPUT!$N$39*$Q12,0)))","v":" "},{"$f":"+IF(SUM(F12:O12)=0,\" \",SUM(F12:O12))","v":78},{"$f":"+IF(CALCULATIONS!O23=\" \",\" \",ROUNDUP(A1*(CALCULATIONS!O23*1.96/0.1)^2,0))","v":72}]
[]
[null,"2. Quarterly Frequency",4]
[null,"    a) 100% UPT Not Available",null,{"$f":"+IF(D$10=\" \",\" \",ROUNDUP(D$10/$C14,0))","v":87},{"$f":"+IF(D15=\" \",\" \",D15*C14)","v":348},17,52,6," "," "," "," "," "," "," ",{"$f":"+IF(Q15=\" \",\" \",SUM(F15:O15)*C14)","v":300},{"$f":"+IF(SUM(F15:O15)=0,\" \",SUM(F15:O15))","v":75}]
[null,"    b) 100% UPT Available",null,{"$f":"+IF(D$11=\" \",\" \",ROUNDUP(D$11/$C14,0))","v":18},{"$f":"+IF(D16=\" \",\" \",D16*C14)","v":72},{"$f":"+IF(F$11=\" \",\" \",ROUNDUP(F$11/$C14,0))","v":4},12,3," "," "," "," "," "," "," ",{"$f":"+IF(Q16=\" \",\" \",SUM(F16:O16)*C14)","v":76},{"$f":"+IF(SUM(F16:O16)=0,\" \",SUM(F16:O16))","v":19}]
[null,"    c) PPMT Option",null,{"$f":"+IF(D$12=\" \",\" \",ROUNDUP(D$12/$C14,0))","v":30},{"$f":"+IF(D17=\" \",\" \",D17*C14)","v":120},{"$f":"+IF(F$12=\" \",\" \",ROUNDUP(F$12/$C14,0))","v":5},13,3," "," "," "," "," "," "," ",{"$f":"+IF(Q17=\" \",\" \",SUM(F17:O17)*C14)","v":84},{"$f":"+IF(SUM(F17:O17)=0,\" \",SUM(F17:O17))","v":21}]
[]
[null,"3. Monthly Frquency",12]
[null,"    a) 100% UPT Not Available",null,{"$f":"+IF(D$10=\" \",\" \",ROUNDUP(D$10/$C19,0))","v":29},{"$f":"+IF(D20=\" \",\" \",D20*C19)","v":348},6,18,2," "," "," "," "," "," "," ",{"$f":"+IF(Q20=\" \",\" \",SUM(F20:O20)*C19)","v":312},{"$f":"+IF(SUM(F20:O20)=0,\" \",SUM(F20:O20))","v":26}]
[null,"    b) 100% UPT Available",null,{"$f":"+IF(D$11=\" \",\" \",ROUNDUP(D$11/$C19,0))","v":6},{"$f":"+IF(D21=\" \",\" \",D21*C19)","v":72},{"$f":"+IF(F$11=\" \",\" \",ROUNDUP(F$11/$C19,0))","v":2},4,1," "," "," "," "," "," "," ",{"$f":"+IF(Q21=\" \",\" \",SUM(F21:O21)*C19)","v":84},{"$f":"+IF(SUM(F21:O21)=0,\" \",SUM(F21:O21))","v":7}]
[null,"    c) PPMT Option",null,{"$f":"+IF(D$12=\" \",\" \",ROUNDUP(D$12/$C19,0))","v":10},{"$f":"+IF(D22=\" \",\" \",D22*C19)","v":120},{"$f":"+IF(F$12=\" \",\" \",ROUNDUP(F$12/$C19,0))","v":2},5,1," "," "," "," "," "," "," ",{"$f":"+IF(Q22=\" \",\" \",SUM(F22:O22)*C19)","v":96},{"$f":"+IF(SUM(F22:O22)=0,\" \",SUM(F22:O22))","v":8}]
[]
[null,"4. Weekly Frequency",52]
[null,"    a) 100% UPT Not Available",null,{"$f":"+IF(D$10=\" \",\" \",ROUNDUP(D$10/$C24,0))","v":7},{"$f":"+IF(D25=\" \",\" \",D25*C24)","v":364},2,4,1," "," "," "," "," "," "," ",{"$f":"+IF(Q25=\" \",\" \",SUM(F25:O25)*C24)","v":364},{"$f":"+IF(SUM(F25:O25)=0,\" \",SUM(F25:O25))","v":7}]
[null,"    b) 100% UPT Available",null,{"$f":"+IF(D$11=\" \",\" \",ROUNDUP(D$11/$C24,0))","v":2},{"$f":"+IF(D26=\" \",\" \",D26*C24)","v":104},{"$f":"+IF(F$11=\" \",\" \",ROUNDUP(F$11/$C24,0))","v":1},1,1," "," "," "," "," "," "," ",{"$f":"+IF(Q26=\" \",\" \",SUM(F26:O26)*C24)","v":156},{"$f":"+IF(SUM(F26:O26)=0,\" \",SUM(F26:O26))","v":3}]
[null,"    c) PPMT Option",null,{"$f":"+IF(D$12=\" \",\" \",ROUNDUP(D$12/$C24,0))","v":3},{"$f":"+IF(D27=\" \",\" \",D27*C24)","v":156},{"$f":"+IF(F$12=\" \",\" \",ROUNDUP(F$12/$C24,0))","v":1},1,1," "," "," "," "," "," ",null,{"$f":"+IF(Q27=\" \",\" \",Q27*C24)","v":156},{"$f":"+IF(SUM(F27:O27)=0,\" \",SUM(F27:O27))","v":3}]
[]
[]
[null,"B. Description of Options"]
[]
[null,"1. Sampling Frequency"]
[]
[null,"a) Annual = sample size during an entire year that is determined from analyzing the sample data you have entered.  A margin of safety has been built into this sample size to guard against fluctuations of service and usage patterns in your system.  It is logistically difficult to select a random sample for an entire year at the same time, since you may not know at the start of the year what vehicle trips you will operate for the entire year.  Most agencies choose to select a sample quarterly, monthly, or weekly."]
[]
[null,"b) Quarterly = sample size during an entire quarter if you choose to select a sample once every three months."]
[]
[null,"c) Monthly = sample size during an entire month if you choose to select a sample once every month."]
[]
[null,"d) Weekly = sample size during a week if you choose to select a sample once every week."]
[]
[null,"e) Choose the sampling frequency that works best for you. Shorter selection periods are usually easier to manage because you have a better idea what service you will operate, and the number of trips you must select per period is smaller. But due to rounding when the annual sample is allocated to each of these periods, the annual sample size is higher if you use shorter periods.  "]
[]
[null,"2. Grouping for Improving Sampling Efficiency"]
[]
[null,"        Grouping is one method for you to improve your sampling efficiency. For in-depth discussion of grouping, please refer to the NTD Sampling Manual sections on \"Route Grouping\"."]
[]
[null,"a) Without Grouping= you sample and estimate service consumed without dividing your overall operation into distinct groups."]
[]
[null,"b) With Grouping = you sample and estimate service consumed data by dividing your overall operation into two or more distinct groups."]
[]
[null,"c) Cells F7:O7 = group names if you use grouping and empty if you do not."]
[]
[null,"3. Other Options for Improving Sampling Efficiency"]
[]
[null,"a) If you will not be reporting a 100% count of UPT for a future NTD reporting year, you must use the Base option.  "]
[]
[null,"b) If you will be reporting a 100% count of UPT for a future NTD reporting year, you may use either the APTL option or the PPMT option.  You have both options for you to consider if you have entered your sample data on UPT, PMT, and PPMT into INPUT.  You only have the APTL option if you have entered your sample data on UPT and PMT but not on PPMT."]
[null," "]
[null,"c) When you do have both the APTL and PPMT options, you should choose the APTL option if it gives you a smaller annual sample size.  Otherwise you need to decide whether the extra effort required in estimating annual data for the NTD is more trouble than the smaller sample size that the PPMT option gives you.    "]

{"sheet":"CALCULATIONS","index":3,"n_rows":43,"n_cols":30,"rows_kept":43,"cut":false,"hidden":false,"merged":[[4,4,4,14],[4,19,4,29]]}
[null,"Calculations"]
[]
[null,"A. Sample Data Analysis",null,null,null,null,null,null,null,null,null,null,null,null," ",null,null,null," "]
[]
[null,null,null,"Without","With Grouping",null,null,null,null,null,null,null,null,null,null,null,null,null,"Without","With Grouping"]
[null," ",null,"Grouping",{"$f":"+IF(CALCULATIONS!E8=0,\" \",INPUT!D33)","v":"Short Routes"},{"$f":"+IF(CALCULATIONS!F8=0,\" \",INPUT!E33)","v":"Medium Routes"},{"$f":"+IF(CALCULATIONS!G8=0,\" \",INPUT!F33)","v":"Long Routes"},{"$f":"+IF(CALCULATIONS!H8=0,\" \",INPUT!G33)","v":""},{"$f":"+IF(CALCULATIONS!I8=0,\" \",INPUT!H33)","v":""},{"$f":"+IF(CALCULATIONS!J8=0,\" \",INPUT!I33)","v":""},{"$f":"+IF(CALCULATIONS!K8=0,\" \",INPUT!J33)","v":""},{"$f":"+IF(CALCULATIONS!L8=0,\" \",INPUT!K33)","v":""},{"$f":"+IF(CALCULATIONS!M8=0,\" \",INPUT!L33)","v":""},{"$f":"+IF(CALCULATIONS!N8=0,\" \",INPUT!M33)","v":""},"All",null," ",null,"Grouping",{"$f":"+IF(CALCULATIONS!T8=0,\" \",INPUT!P33)","v":""},{"$f":"+IF(CALCULATIONS!U8=0,\" \",INPUT!Q33)","v":""},{"$f":"+IF(CALCULATIONS!V8=0,\" \",INPUT!R33)","v":""},{"$f":"+IF(CALCULATIONS!W8=0,\" \",INPUT!S33)","v":""},{"$f":"+IF(CALCULATIONS!X8=0,\" \",INPUT!T33)","v":""},{"$f":"+IF(CALCULATIONS!Y8=0,\" \",INPUT!U33)","v":""},{"$f":"+IF(CALCULATIONS!Z8=0,\" \",INPUT!V33)","v":""},{"$f":"+IF(CALCULATIONS!AA8=0,\" \",INPUT!W33)","v":""},{"$f":"+IF(CALCULATIONS!AB8=0,\" \",INPUT!X33)","v":""},{"$f":"+IF(CALCULATIONS!AC8=0,\" \",INPUT!Y33)","v":""},"All"]
[]
[null,"Group Size in the Sample",null,{"$f":"+IF(COUNT(PMT)=0,\" \",COUNT(PMT))","v":549},{"$f":"+IF(INPUT!D33=\"\",\" \",COUNT(IF(Group=INPUT!D$33,PMT)))","v":116},{"$f":"+IF(INPUT!E33=\"\",\" \",COUNT(IF(Group=INPUT!E$33,PMT)))","v":386},{"$f":"+IF(INPUT!F33=\"\",\" \",COUNT(IF(Group=INPUT!F$33,PMT)))","v":47},{"$f":"+IF(INPUT!G33=\"\",\" \",COUNT(IF(Group=INPUT!G$33,PMT)))","v":" "},{"$f":"+IF(INPUT!H33=\"\",\" \",COUNT(IF(Group=INPUT!H$33,PMT)))","v":" "},{"$f":"+IF(INPUT!I33=\"\",\" \",COUNT(IF(Group=INPUT!I$33,PMT)))","v":" "},{"$f":"+IF(INPUT!J33=\"\",\" \",COUNT(IF(Group=INPUT!J$33,PMT)))","v":" "},{"$f":"+IF(INPUT!K33=\"\",\" \",COUNT(IF(Group=INPUT!K$33,PMT)))","v":" "},{"$f":"+IF(INPUT!L33=\"\",\" \",COUNT(IF(Group=INPUT!L$33,PMT)))","v":" "},{"$f":"+IF(INPUT!M33=\"\",\" \",COUNT(IF(Group=INPUT!M$33,PMT)))","v":" "},{"$f":"+IF(SUM(E8:N8)=0,\" \",SUM(E8:N8))","v":549},null,"Group Size in the Sample",null,{"$f":"+IF(COUNT(PMT_orig)=0,\" \",COUNT(PMT_orig))","v":" "},{"$f":"+IF(INPUT!P33=\"\",\" \",COUNT(IF(Group_orig=INPUT!P$33,PMT_orig)))","v":" "},{"$f":"+IF(INPUT!Q33=\"\",\" \",COUNT(IF(Group_orig=INPUT!Q$33,PMT_orig)))","v":" "},{"$f":"+IF(INPUT!R33=\"\",\" \",COUNT(IF(Group_orig=INPUT!R$33,PMT_orig)))","v":" "},{"$f":"+IF(INPUT!S33=\"\",\" \",COUNT(IF(Group_orig=INPUT!S$33,PMT_orig)))","v":" "},{"$f":"+IF(INPUT!T33=\"\",\" \",COUNT(IF(Group_orig=INPUT!T$33,PMT_orig)))","v":" "},{"$f":"+IF(INPUT!U33=\"\",\" \",COUNT(IF(Group_orig=INPUT!U$33,PMT_orig)))","v":" "},{"$f":"+IF(INPUT!V33=\"\",\" \",COUNT(IF(Group_orig=INPUT!V$33,PMT_orig)))","v":" "},{"$f":"+IF(INPUT!W33=\"\",\" \",COUNT(IF(Group_orig=INPUT!W$33,PMT_orig)))","v":" "},{"$f":"+IF(INPUT!X33=\"\",\" \",COUNT(IF(Group_orig=INPUT!X$33,PMT_orig)))","v":" "},{"$f":"+IF(INPUT!Y33=\"\",\" \",COUNT(IF(Group_orig=INPUT!Y$33,PMT_orig)))","v":" "},{"$f":"+IF(SUM(T8:AC8)=0,\" \",SUM(T8:AC8))","v":" "}]
[]
[null,"Average",null," ",null,null,null,null,null,null,null,null,null,null,null,null,"Average",null," "]
[null,"     UPT",null,{"$f":"+IF(SUM(UPT)=0,\" \",AVERAGE(UPT))","v":19.908925318761383},{"$f":"+IF(OR(SUM(UPT)=0,E8=\" \"),\" \",AVERAGE(IF(Group=E6,UPT)))","v":9.9741379310344822},{"$f":"+IF(OR(SUM(UPT)=0,F8=\" \"),\" \",AVERAGE(IF(Group=F6,UPT)))","v":21.194300518134714},{"$f":"+IF(OR(SUM(UPT)=0,G8=\" \"),\" \",AVERAGE(IF(Group=G6,UPT)))","v":33.872340425531917},{"$f":"+IF(OR(SUM(UPT)=0,H8=\" \"),\" \",AVERAGE(IF(Group=H6,UPT)))","v":" "},{"$f":"+IF(OR(SUM(UPT)=0,I8=\" \"),\" \",AVERAGE(IF(Group=I6,UPT)))","v":" "},{"$f":"+IF(OR(SUM(UPT)=0,J8=\" \"),\" \",AVERAGE(IF(Group=J6,UPT)))","v":" "},{"$f":"+IF(OR(SUM(UPT)=0,K8=\" \"),\" \",AVERAGE(IF(Group=K6,UPT)))","v":" "},{"$f":"+IF(OR(SUM(UPT)=0,L8=\" \"),\" \",AVERAGE(IF(Group=L6,UPT)))","v":" "},{"$f":"+IF(OR(SUM(UPT)=0,M8=\" \"),\" \",AVERAGE(IF(Group=M6,UPT)))","v":" "},{"$f":"+IF(OR(SUM(UPT)=0,N8=\" \"),\" \",AVERAGE(IF(Group=N6,UPT)))","v":" "},{"$f":"+IF(SUM(SizeActual)=0,\" \",IF(SUM(E11:N11)=0,\" \",IF(E$8=\" \",0,E11*(INPUT!D$34/INPUT!N$34))+IF(F$8=\" \",0,F11*(INPUT!E$34/INPUT!N$34))+IF(G$8=\" \",0,G11*(INPUT!F$34/INPUT!N$34))+IF(H$8=\" \",0,H11*(INPUT!G$34/INPUT!N$34))+IF(I$8=\" \",0,I11*(INPUT!H$34/INPUT!N$34))+IF(J$8=\" \",0,J11*(INPUT!I$34/INPUT!N$34))+IF(K$8=\" \",0,K11*(INPUT!J$34/INPUT!N$34))+IF(L$8=\" \",0,L11*(INPUT!K$34/INPUT!N$34))+IF(M$8=\" \",0,M11*(INPUT!L$34/INPUT!N$34))+IF(N$8=\" \",0,N11*(INPUT!M$34/INPUT!N$34))))","v":19.549844505469295},null,"     UPT",null,{"$f":"+IF(SUM(UPT_orig)=0,\" \",AVERAGE(UPT_orig))","v":" "},{"$f":"+IF(OR(SUM(UPT_orig)=0,T8=\" \"),\" \",AVERAGE(IF(Group_orig=T6,UPT_orig)))","v":" "},{"$f":"+IF(OR(SUM(UPT_orig)=0,U8=\" \"),\" \",AVERAGE(IF(Group_orig=U6,UPT_orig)))","v":" "},{"$f":"+IF(OR(SUM(UPT_orig)=0,V8=\" \"),\" \",AVERAGE(IF(Group_orig=V6,UPT_orig)))","v":" "},{"$f":"+IF(OR(SUM(UPT_orig)=0,W8=\" \"),\" \",AVERAGE(IF(Group_orig=W6,UPT_orig)))","v":" "},{"$f":"+IF(OR(SUM(UPT_orig)=0,X8=\" \"),\" \",AVERAGE(IF(Group_orig=X6,UPT_orig)))","v":" "},{"$f":"+IF(OR(SUM(UPT_orig)=0,Y8=\" \"),\" \",AVERAGE(IF(Group_orig=Y6,UPT_orig)))","v":" "},{"$f":"+IF(OR(SUM(UPT_orig)=0,Z8=\" \"),\" \",AVERAGE(IF(Group_orig=Z6,UPT_orig)))","v":" "},{"$f":"+IF(OR(SUM(UPT_orig)=0,AA8=\" \"),\" \",AVERAGE(IF(Group_orig=AA6,UPT_orig)))","v":" "},{"$f":"+IF(OR(SUM(UPT_orig)=0,AB8=\" \"),\" \",AVERAGE(IF(Group_orig=AB6,UPT_orig)))","v":" "},{"$f":"+IF(OR(SUM(UPT_orig)=0,AC8=\" \"),\" \",AVERAGE(IF(Group_orig=AC6,UPT_orig)))","v":" "},{"$f":"+IF(SUM(SizeActual_orig)=0,\" \",IF(SUM(T11:AC11)=0,\" \",IF(T$8=\" \",0,T11*(INPUT!P$34/INPUT!Z$34))+IF(U$8=\" \",0,U11*(INPUT!Q$34/INPUT!Z$34))+IF(V$8=\" \",0,V11*(INPUT!R$34/INPUT!Z$34))+IF(W$8=\" \",0,W11*(INPUT!S$34/INPUT!Z$34))+IF(X$8=\" \",0,X11*(INPUT!T$34/INPUT!Z$34))+IF(Y$8=\" \",0,Y11*(INPUT!U$34/INPUT!Z$34))+IF(Z$8=\" \",0,Z11*(INPUT!V$34/INPUT!Z$34))+IF(AA$8=\" \",0,AA11*(INPUT!W$34/INPUT!Z$34))+IF(AB$8=\" \",0,AB11*(INPUT!X$34/INPUT!Z$34))+IF(AC$8=\" \",0,AC11*(INPUT!Y$34/INPUT!Z$34))))","v":" "}]
[null,"     PMT",null,{"$f":"+IF(SUM(PMT)=0,\" \",AVERAGE(PMT))","v":98.283242258652123},{"$f":"+IF(OR(SUM(PMT)=0,E8=\" \"),\" \",AVERAGE(IF(Group=E6,PMT)))","v":34.38620689655172},{"$f":"+IF(OR(SUM(PMT)=0,F8=\" \"),\" \",AVERAGE(IF(Group=F6,PMT)))","v":111.31036269430057},{"$f":"+IF(OR(SUM(PMT)=0,G8=\" \"),\" \",AVERAGE(IF(Group=G6,PMT)))","v":148.99787234042552},{"$f":"+IF(OR(SUM(PMT)=0,H8=\" \"),\" \",AVERAGE(IF(Group=H6,PMT)))","v":" "},{"$f":"+IF(OR(SUM(PMT)=0,I8=\" \"),\" \",AVERAGE(IF(Group=I6,PMT)))","v":" "},{"$f":"+IF(OR(SUM(PMT)=0,J8=\" \"),\" \",AVERAGE(IF(Group=J6,PMT)))","v":" "},{"$f":"+IF(OR(SUM(PMT)=0,K8=\" \"),\" \",AVERAGE(IF(Group=K6,PMT)))","v":" "},{"$f":"+IF(OR(SUM(PMT)=0,L8=\" \"),\" \",AVERAGE(IF(Group=L6,PMT)))","v":" "},{"$f":"+IF(OR(SUM(PMT)=0,M8=\" \"),\" \",AVERAGE(IF(Group=M6,PMT)))","v":" "},{"$f":"+IF(OR(SUM(PMT)=0,N8=\" \"),\" \",AVERAGE(IF(Group=N6,PMT)))","v":" "},{"$f":"+IF(SUM(INPUT!D34:M34)=0,\" \",IF(SUM(E12:N12)=0,\" \",IF(E$8=\" \",0,E12*(INPUT!D$34/INPUT!N$34))+IF(F$8=\" \",0,F12*(INPUT!E$34/INPUT!N$34))+IF(G$8=\" \",0,G12*(INPUT!F$34/INPUT!N$34))+IF(H$8=\" \",0,H12*(INPUT!G$34/INPUT!N$34))+IF(I$8=\" \",0,I12*(INPUT!H$34/INPUT!N$34))+IF(J$8=\" \",0,J12*(INPUT!I$34/INPUT!N$34))+IF(K$8=\" \",0,K12*(INPUT!J$34/INPUT!N$34))+IF(L$8=\" \",0,L12*(INPUT!K$34/INPUT!N$34))+IF(M$8=\" \",0,M12*(INPUT!L$34/INPUT!N$34))+IF(N$8=\" \",0,N12*(INPUT!M$34/INPUT!N$34))))","v":96.382898682800104},null,"     PMT",null,{"$f":"+IF(SUM(PMT_orig)=0,\" \",AVERAGE(PMT_orig))","v":" "},{"$f":"+IF(OR(SUM(PMT_orig)=0,T8=\" \"),\" \",AVERAGE(IF(Group_orig=T6,PMT_orig)))","v":" "},{"$f":"+IF(OR(SUM(PMT_orig)=0,U8=\" \"),\" \",AVERAGE(IF(Group_orig=U6,PMT_orig)))","v":" "},{"$f":"+IF(OR(SUM(PMT_orig)=0,V8=\" \"),\" \",AVERAGE(IF(Group_orig=V6,PMT_orig)))","v":" "},{"$f":"+IF(OR(SUM(PMT_orig)=0,W8=\" \"),\" \",AVERAGE(IF(Group_orig=W6,PMT_orig)))","v":" "},{"$f":"+IF(OR(SUM(PMT_orig)=0,X8=\" \"),\" \",AVERAGE(IF(Group_orig=X6,PMT_orig)))","v":" "},{"$f":"+IF(OR(SUM(PMT_orig)=0,Y8=\" \"),\" \",AVERAGE(IF(Group_orig=Y6,PMT_orig)))","v":" "},{"$f":"+IF(OR(SUM(PMT_orig)=0,Z8=\" \"),\" \",AVERAGE(IF(Group_orig=Z6,PMT_orig)))","v":" "},{"$f":"+IF(OR(SUM(PMT_orig)=0,AA8=\" \"),\" \",AVERAGE(IF(Group_orig=AA6,PMT_orig)))","v":" "},{"$f":"+IF(OR(SUM(PMT_orig)=0,AB8=\" \"),\" \",AVERAGE(IF(Group_orig=AB6,PMT_orig)))","v":" "},{"$f":"+IF(OR(SUM(PMT_orig)=0,AC8=\" \"),\" \",AVERAGE(IF(Group_orig=AC6,PMT_orig)))","v":" "},{"$f":"+IF(SUM(SizeActual_orig)=0,\" \",IF(SUM(T12:AC12)=0,\" \",IF(T$8=\" \",0,T12*(INPUT!P$34/INPUT!Z$34))+IF(U$8=\" \",0,U12*(INPUT!Q$34/INPUT!Z$34))+IF(V$8=\" \",0,V12*(INPUT!R$34/INPUT!Z$34))+IF(W$8=\" \",0,W12*(INPUT!S$34/INPUT!Z$34))+IF(X$8=\" \",0,X12*(INPUT!T$34/INPUT!Z$34))+IF(Y$8=\" \",0,Y12*(INPUT!U$34/INPUT!Z$34))+IF(Z$8=\" \",0,Z12*(INPUT!V$34/INPUT!Z$34))+IF(AA$8=\" \",0,AA12*(INPUT!W$34/INPUT!Z$34))+IF(AB$8=\" \",0,AB12*(INPUT!X$34/INPUT!Z$34))+IF(AC$8=\" \",0,AC12*(INPUT!Y$34/INPUT!Z$34))))","v":" "}]
[null,"     PPMT",null,{"$f":"+IF(SUM(PPMT)=0,\" \",AVERAGE(PPMT))","v":301.36381848865545},{"$f":"+IF(OR(SUM(PPMT)=0,E8=\" \"),\" \",AVERAGE(IF(Group=E6,PPMT)))","v":78.2686456956298},{"$f":"+IF(OR(SUM(PPMT)=0,F8=\" \"),\" \",AVERAGE(IF(Group=F6,PPMT)))","v":316.5787849172039},{"$f":"+IF(OR(SUM(PPMT)=0,G8=\" \"),\" \",AVERAGE(IF(Group=G6,PPMT)))","v":727.02473343698034},{"$f":"+IF(OR(SUM(PPMT)=0,H8=\" \"),\" \",AVERAGE(IF(Group=H6,PPMT)))","v":" "},{"$f":"+IF(OR(SUM(PPMT)=0,I8=\" \"),\" \",AVERAGE(IF(Group=I6,PPMT)))","v":" "},{"$f":"+IF(OR(SUM(PPMT)=0,J8=\" \"),\" \",AVERAGE(IF(Group=J6,PPMT)))","v":" "},{"$f":"+IF(OR(SUM(PPMT)=0,K8=\" \"),\" \",AVERAGE(IF(Group=K6,PPMT)))","v":" "},{"$f":"+IF(OR(SUM(PPMT)=0,L8=\" \"),\" \",AVERAGE(IF(Group=L6,PPMT)))","v":" "},{"$f":"+IF(OR(SUM(PPMT)=0,M8=\" \"),\" \",AVERAGE(IF(Group=M6,PPMT)))","v":" "},{"$f":"+IF(OR(SUM(PPMT)=0,N8=\" \"),\" \",AVERAGE(IF(Group=N6,PPMT)))","v":" "},{"$f":"+IF(SUM(INPUT!D34:M34)=0,\" \",IF(SUM(E13:N13)=0,\" \",IF(E$8=\" \",0,E13*(INPUT!D$34/INPUT!N$34)+IF(F$8=\" \",0,F13*(INPUT!E$34/INPUT!N$34))+IF(G$8=\" \",0,G13*(INPUT!F$34/INPUT!N$34))+IF(H$8=\" \",0,H13*(INPUT!G$34/INPUT!N$34))+IF(I$8=\" \",0,I13*(INPUT!H$34/INPUT!N$34))+IF(J$8=\" \",0,J13*(INPUT!I$34/INPUT!N$34))+IF(K$8=\" \",0,K13*(INPUT!J$34/INPUT!N$34))+IF(L$8=\" \",0,L13*(INPUT!K$34/INPUT!N$34))+IF(M$8=\" \",0,M13*(INPUT!L$34/INPUT!N$34))+IF(N$8=\" \",0,N13*(INPUT!M$34/INPUT!N$34)))))","v":292.12711880919005},null,"     PPMT",null,{"$f":"+IF(SUM(PPMT_orig)=0,\" \",AVERAGE(PPMT_orig))","v":" "},{"$f":"+IF(OR(SUM(PPMT_orig)=0,T8=\" \"),\" \",AVERAGE(IF(Group_orig=T6,PPMT_orig)))","v":" "},{"$f":"+IF(OR(SUM(PPMT_orig)=0,U8=\" \"),\" \",AVERAGE(IF(Group_orig=U6,PPMT_orig)))","v":" "},{"$f":"+IF(OR(SUM(PPMT_orig)=0,V8=\" \"),\" \",AVERAGE(IF(Group_orig=V6,PPMT_orig)))","v":" "},{"$f":"+IF(OR(SUM(PPMT_orig)=0,W8=\" \"),\" \",AVERAGE(IF(Group_orig=W6,PPMT_orig)))","v":" "},{"$f":"+IF(OR(SUM(PPMT_orig)=0,X8=\" \"),\" \",AVERAGE(IF(Group_orig=X6,PPMT_orig)))","v":" "},{"$f":"+IF(OR(SUM(PPMT_orig)=0,Y8=\" \"),\" \",AVERAGE(IF(Group_orig=Y6,PPMT_orig)))","v":" "},{"$f":"+IF(OR(SUM(PPMT_orig)=0,Z8=\" \"),\" \",AVERAGE(IF(Group_orig=Z6,PPMT_orig)))","v":" "},{"$f":"+IF(OR(SUM(PPMT_orig)=0,AA8=\" \"),\" \",AVERAGE(IF(Group_orig=AA6,PPMT_orig)))","v":" "},{"$f":"+IF(OR(SUM(PPMT_orig)=0,AB8=\" \"),\" \",AVERAGE(IF(Group_orig=AB6,PPMT_orig)))","v":" "},{"$f":"+IF(OR(SUM(PPMT_orig)=0,AC8=\" \"),\" \",AVERAGE(IF(Group_orig=AC6,PPMT_orig)))","v":" "},{"$f":"+IF(SUM(SizeActual_orig)=0,\" \",IF(SUM(T13:AC13)=0,\" \",IF(T$8=\" \",0,T13*(INPUT!P$34/INPUT!Z$34))+IF(U$8=\" \",0,U13*(INPUT!Q$34/INPUT!Z$34))+IF(V$8=\" \",0,V13*(INPUT!R$34/INPUT!Z$34))+IF(W$8=\" \",0,W13*(INPUT!S$34/INPUT!Z$34))+IF(X$8=\" \",0,X13*(INPUT!T$34/INPUT!Z$34))+IF(Y$8=\" \",0,Y13*(INPUT!U$34/INPUT!Z$34))+IF(Z$8=\" \",0,Z13*(INPUT!V$34/INPUT!Z$34))+IF(AA$8=\" \",0,AA13*(INPUT!W$34/INPUT!Z$34))+IF(AB$8=\" \",0,AB13*(INPUT!X$34/INPUT!Z$34))+IF(AC$8=\" \",0,AC13*(INPUT!Y$34/INPUT!Z$34))))","v":" "}]
[null,"     APTL",null,{"$f":"+IF(OR(SUM(UPT)=0,SUM(PMT)=0),\" \",D12/D11)","v":4.936642268984448},{"$f":"+IF(OR(SUM(UPT)=0,SUM(PMT)=0,E8=\" \"),\" \",E12/E11)","v":3.4475367329299913},{"$f":"+IF(OR(SUM(UPT)=0,SUM(PMT)=0,F8=\" \"),\" \",F12/F11)","v":5.2519007456301212},{"$f":"+IF(OR(SUM(UPT)=0,SUM(PMT)=0,G8=\" \"),\" \",G12/G11)","v":4.3988065326633157},{"$f":"+IF(OR(SUM(UPT)=0,SUM(PMT)=0,H8=\" \"),\" \",H12/H11)","v":" "},{"$f":"+IF(OR(SUM(UPT)=0,SUM(PMT)=0,I8=\" \"),\" \",I12/I11)","v":" "},{"$f":"+IF(OR(SUM(UPT)=0,SUM(PMT)=0,J8=\" \"),\" \",J12/J11)","v":" "},{"$f":"+IF(OR(SUM(UPT)=0,SUM(PMT)=0,K8=\" \"),\" \",K12/K11)","v":" "},{"$f":"+IF(OR(SUM(UPT)=0,SUM(PMT)=0,L8=\" \"),\" \",L12/L11)","v":" "},{"$f":"+IF(OR(SUM(UPT)=0,SUM(PMT)=0,M8=\" \"),\" \",M12/M11)","v":" "},{"$f":"+IF(OR(SUM(UPT)=0,SUM(PMT)=0,N8=\" \"),\" \",N12/N11)","v":" "},{"$f":"+IF(O12=\" \",\" \",IF(SUM(E14:N14)=0,\" \",O12/O11))","v":4.9301107564224296},null,"     APTL",null,{"$f":"+IF(OR(SUM(UPT_orig)=0,SUM(PMT_orig)=0),\" \",S12/S11)","v":" "},{"$f":"+IF(OR(SUM(UPT_orig)=0,SUM(PMT_orig)=0,T8=\" \"),\" \",T12/T11)","v":" "}," "," "," "," "," "," "," "," "," ",{"$f":"+IF(AD12=\" \",\" \",IF(SUM(T14:AC14)=0,\" \",AD12/AD11))","v":" "}]
[null,"     PMT/PPMT",null,{"$f":"+IF(OR(SUM(PMT)=0,SUM(PPMT)=0),\" \",D12/D13)","v":0.32612820859366665},{"$f":"+IF(OR(SUM(PMT)=0,SUM(PPMT)=0,E8=\" \"),\" \",E12/E13)","v":0.43933565722182549},{"$f":"+IF(OR(SUM(PMT)=0,SUM(PPMT)=0,F8=\" \"),\" \",F12/F13)","v":0.35160398610858273},{"$f":"+IF(OR(SUM(PMT)=0,SUM(PPMT)=0,G8=\" \"),\" \",G12/G13)","v":0.2049419579386853},{"$f":"+IF(OR(SUM(PMT)=0,SUM(PPMT)=0,H8=\" \"),\" \",H12/H13)","v":" "},{"$f":"+IF(OR(SUM(PMT)=0,SUM(PPMT)=0,I8=\" \"),\" \",I12/I13)","v":" "},{"$f":"+IF(OR(SUM(PMT)=0,SUM(PPMT)=0,J8=\" \"),\" \",J12/J13)","v":" "},{"$f":"+IF(OR(SUM(PMT)=0,SUM(PPMT)=0,K8=\" \"),\" \",K12/K13)","v":" "},{"$f":"+IF(OR(SUM(PMT)=0,SUM(PPMT)=0,L8=\" \"),\" \",L12/L13)","v":" "},{"$f":"+IF(OR(SUM(PMT)=0,SUM(PPMT)=0,M8=\" \"),\" \",M12/M13)","v":" "},{"$f":"+IF(OR(SUM(PMT)=0,SUM(PPMT)=0,N8=\" \"),\" \",N12/N13)","v":" "},{"$f":"+IF(O12=\" \",\" \",IF(SUM(E15:N15)=0,\" \",O12/O13))","v":0.32993478686843497},null,"     PMT/PPMT",null,{"$f":"+IF(OR(SUM(PMT_orig)=0,SUM(PPMT_orig)=0),\" \",S12/S13)","v":" "},{"$f":"+IF(OR(SUM(PMT_orig)=0,SUM(PPMT_orig)=0,T8=\" \"),\" \",T12/T13)","v":" "}," "," "," "," "," "," "," "," "," ",{"$f":"+IF(AD12=\" \",\" \",IF(SUM(T15:AC15)=0,\" \",AD12/AD13))","v":" "}]
[]
[null,"Unit Coefficient of Variation",null,null,null,null,null,null,null,null,null,null,null,null,null,null,"Unit Coefficient of Variation"]
[null,"     UPT",null,{"$f":"+IF(SUM(UPT)=0,\" \",SQRT(VAR(UPT))/D11)","v":0.76557086104096717},{"$f":"+IF(OR(SUM(UPT)=0,E8=\" \"),\" \",SQRT(VAR(IF(Group=E6,UPT)))/E11)","v":0.94148724373564985},{"$f":"+IF(OR(SUM(UPT)=0,F8=\" \"),\" \",SQRT(VAR(IF(Group=F6,UPT)))/F11)","v":0.66736709039146558},{"$f":"+IF(OR(SUM(UPT)=0,G8=\" \"),\" \",SQRT(VAR(IF(Group=G6,UPT)))/G11)","v":0.59825047557303168},{"$f":"+IF(OR(SUM(UPT)=0,H8=\" \"),\" \",SQRT(VAR(IF(Group=H6,UPT)))/H11)","v":" "},{"$f":"+IF(OR(SUM(UPT)=0,I8=\" \"),\" \",SQRT(VAR(IF(Group=I6,UPT)))/I11)","v":" "},{"$f":"+IF(OR(SUM(UPT)=0,J8=\" \"),\" \",SQRT(VAR(IF(Group=J6,UPT)))/J11)","v":" "},{"$f":"+IF(OR(SUM(UPT)=0,K8=\" \"),\" \",SQRT(VAR(IF(Group=K6,UPT)))/K11)","v":" "},{"$f":"+IF(OR(SUM(UPT)=0,L8=\" \"),\" \",SQRT(VAR(IF(Group=L6,UPT)))/L11)","v":" "},{"$f":"+IF(OR(SUM(UPT)=0,M8=\" \"),\" \",SQRT(VAR(IF(Group=M6,UPT)))/M11)","v":" "},{"$f":"+IF(OR(SUM(UPT)=0,N8=\" \"),\" \",SQRT(VAR(IF(Group=N6,UPT)))/N11)","v":" "},{"$f":"+IF(SUM(INPUT!D34:M34)=0,\" \",IF(SUM(E18:N18)=0,\" \",SQRT(IF(E$8=\" \",0,(INPUT!D$34/INPUT!N$34)*($E18*$E11)^2)+IF(F$8=\" \",0,(INPUT!E$34/INPUT!N$34)*($F18*$F11)^2)+IF(G$8=\" \",0,(INPUT!F$34/INPUT!N$34)*($G18*$G11)^2)+IF(H$8=\" \",0,(INPUT!G$34/INPUT!N$34)*($H18*$H11)^2)+IF(I$8=\" \",0,(INPUT!H$34/INPUT!N$34)*($I18*$I11)^2)+IF(J$8=\" \",0,(INPUT!I$34/INPUT!N$34)*($J18*$J11)^2)+IF(K$8=\" \",0,(INPUT!J$34/INPUT!N$34)*($K18*$K11)^2)+IF(L$8=\" \",0,(INPUT!K$34/INPUT!N$34)*($L18*$L11)^2)+IF(M$8=\" \",0,(INPUT!L$34/INPUT!N$34)*($M18*$M11)^2)+IF(N$8=\" \",0,(INPUT!M$34/INPUT!N$34)*($N18*$N11)^2))/O11))","v":0.70490585820578677},null,"     UPT",null,{"$f":"+IF(SUM(UPT_orig)=0,\" \",SQRT(VAR(UPT_orig))/S11)","v":" "},{"$f":"+IF(OR(SUM(UPT_orig)=0,T8=\" \"),\" \",SQRT(VAR(IF(Group_orig=T6,UPT_orig)))/T11)","v":" "},{"$f":"+IF(OR(SUM(UPT_orig)=0,U8=\" \"),\" \",SQRT(VAR(IF(Group_orig=U6,UPT_orig)))/U11)","v":" "},{"$f":"+IF(OR(SUM(UPT_orig)=0,V8=\" \"),\" \",SQRT(VAR(IF(Group_orig=V6,UPT_orig)))/V11)","v":" "},{"$f":"+IF(OR(SUM(UPT_orig)=0,W8=\" \"),\" \",SQRT(VAR(IF(Group_orig=W6,UPT_orig)))/W11)","v":" "},{"$f":"+IF(OR(SUM(UPT_orig)=0,X8=\" \"),\" \",SQRT(VAR(IF(Group_orig=X6,UPT_orig)))/X11)","v":" "},{"$f":"+IF(OR(SUM(UPT_orig)=0,Y8=\" \"),\" \",SQRT(VAR(IF(Group_orig=Y6,UPT_orig)))/Y11)","v":" "},{"$f":"+IF(OR(SUM(UPT_orig)=0,Z8=\" \"),\" \",SQRT(VAR(IF(Group_orig=Z6,UPT_orig)))/Z11)","v":" "},{"$f":"+IF(OR(SUM(UPT_orig)=0,AA8=\" \"),\" \",SQRT(VAR(IF(Group_orig=AA6,UPT_orig)))/AA11)","v":" "},{"$f":"+IF(OR(SUM(UPT_orig)=0,AB8=\" \"),\" \",SQRT(VAR(IF(Group_orig=AB6,UPT_orig)))/AB11)","v":" "},{"$f":"+IF(OR(SUM(UPT_orig)=0,AC8=\" \"),\" \",SQRT(VAR(IF(Group_orig=AC6,UPT_orig)))/AC11)","v":" "},{"$f":"+IF(SUM(INPUT!P$34:Y$34)=0,\" \",IF(SUM(T18:AC18)=0,\" \",SQRT(IF(T$8=\" \",0,(INPUT!P$34/INPUT!Z$34)*($T18*$T11)^2)+IF(U$8=\" \",0,(INPUT!Q$34/INPUT!Z$34)*($U18*$U11)^2)+IF(V$8=\" \",0,(INPUT!R$34/INPUT!Z$34)*($V18*$V11)^2)+IF(W$8=\" \",0,(INPUT!S$34/INPUT!Z$34)*($W18*$W11)^2)+IF(X$8=\" \",0,(INPUT!T$34/INPUT!Z$34)*($X18*$X11)^2)+IF(Y$8=\" \",0,(INPUT!U$34/INPUT!Z$34)*($Y18*$Y11)^2)+IF(Z$8=\" \",0,(INPUT!V$34/INPUT!Z$34)*($Z18*$Z11)^2)+IF(AA$8=\" \",0,(INPUT!W$34/INPUT!Z$34)*($AA18*$AA11)^2)+IF(AB$8=\" \",0,(INPUT!X$34/INPUT!Z$34)*($AB18*$AB11)^2)+IF(AC$8=\" \",0,(INPUT!Y$34/INPUT!Z$34)*($AC18*$AC11)^2))/AD11))","v":" "}]
[null,"     PMT",null,{"$f":"+IF(SUM(PMT)=0,\" \",SQRT(VAR(PMT))/D12)","v":0.85042278271339111},{"$f":"+IF(OR(SUM(PMT)=0,E8=\" \"),\" \",SQRT(VAR(IF(Group=E6,PMT)))/E12)","v":1.1637121487476181},{"$f":"+IF(OR(SUM(PMT)=0,F8=\" \"),\" \",SQRT(VAR(IF(Group=F6,PMT)))/F12)","v":0.73699231327163306},{"$f":"+IF(OR(SUM(PMT)=0,G8=\" \"),\" \",SQRT(VAR(IF(Group=G6,PMT)))/G12)","v":0.62054384571701693},{"$f":"+IF(OR(SUM(PMT)=0,H8=\" \"),\" \",SQRT(VAR(IF(Group=H6,PMT)))/H12)","v":" "},{"$f":"+IF(OR(SUM(PMT)=0,I8=\" \"),\" \",SQRT(VAR(IF(Group=I6,PMT)))/I12)","v":" "},{"$f":"+IF(OR(SUM(PMT)=0,J8=\" \"),\" \",SQRT(VAR(IF(Group=J6,PMT)))/J12)","v":" "},{"$f":"+IF(OR(SUM(PMT)=0,K8=\" \"),\" \",SQRT(VAR(IF(Group=K6,PMT)))/K12)","v":" "},{"$f":"+IF(OR(SUM(PMT)=0,L8=\" \"),\" \",SQRT(VAR(IF(Group=L6,PMT)))/L12)","v":" "},{"$f":"+IF(OR(SUM(PMT)=0,M8=\" \"),\" \",SQRT(VAR(IF(Group=M6,PMT)))/M12)","v":" "},{"$f":"+IF(OR(SUM(PMT)=0,N8=\" \"),\" \",SQRT(VAR(IF(Group=N6,PMT)))/N12)","v":" "},{"$f":"+IF(SUM(INPUT!D34:M34)=0,\" \",IF(SUM(E19:N19)=0,\" \",SQRT(IF(E$8=\" \",0,(INPUT!D$34/INPUT!N$34)*($E19*$E$12)^2)+IF(F$8=\" \",0,(INPUT!E$34/INPUT!N$34)*($F19*$F$12)^2)+IF(G$8=\" \",0,(INPUT!F$34/INPUT!N$34)*($G19*$G$12)^2)+IF(H$8=\" \",0,(INPUT!G$34/INPUT!N$34)*($H19*$H$12)^2)+IF(I$8=\" \",0,(INPUT!H$34/INPUT!N$34)*($I19*$I$12)^2)+IF(J$8=\" \",0,(INPUT!I$34/INPUT!N$34)*($J19*$J$12)^2)+IF(K$8=\" \",0,(INPUT!J$34/INPUT!N$34)*($K19*$K$12)^2)+IF(L$8=\" \",0,(INPUT!K$34/INPUT!N$34)*($L19*$L$12)^2)+IF(M$8=\" \",0,(INPUT!L$34/INPUT!N$34)*($M19*$M$12)^2)+IF(N$8=\" \",0,(INPUT!M$34/INPUT!N$34)*($N19*$N$12)^2))/O$12))","v":0.78215177065387875},null,"     PMT",null,{"$f":"+IF(SUM(PMT_orig)=0,\" \",SQRT(VAR(PMT_orig))/S12)","v":" "},{"$f":"+IF(OR(SUM(PMT_orig)=0,T8=\" \"),\" \",SQRT(VAR(IF(Group_orig=T6,PMT_orig)))/T12)","v":" "},{"$f":"+IF(OR(SUM(PMT_orig)=0,U8=\" \"),\" \",SQRT(VAR(IF(Group_orig=U6,PMT_orig)))/U12)","v":" "},{"$f":"+IF(OR(SUM(PMT_orig)=0,V8=\" \"),\" \",SQRT(VAR(IF(Group_orig=V6,PMT_orig)))/V12)","v":" "},{"$f":"+IF(OR(SUM(PMT_orig)=0,W8=\" \"),\" \",SQRT(VAR(IF(Group_orig=W6,PMT_orig)))/W12)","v":" "},{"$f":"+IF(OR(SUM(PMT_orig)=0,X8=\" \"),\" \",SQRT(VAR(IF(Group_orig=X6,PMT_orig)))/X12)","v":" "},{"$f":"+IF(OR(SUM(PMT_orig)=0,Y8=\" \"),\" \",SQRT(VAR(IF(Group_orig=Y6,PMT_orig)))/Y12)","v":" "},{"$f":"+IF(OR(SUM(PMT_orig)=0,Z8=\" \"),\" \",SQRT(VAR(IF(Group_orig=Z6,PMT_orig)))/Z12)","v":" "},{"$f":"+IF(OR(SUM(PMT_orig)=0,AA8=\" \"),\" \",SQRT(VAR(IF(Group_orig=AA6,PMT_orig)))/AA12)","v":" "},{"$f":"+IF(OR(SUM(PMT_orig)=0,AB8=\" \"),\" \",SQRT(VAR(IF(Group_orig=AB6,PMT_orig)))/AB12)","v":" "},{"$f":"+IF(OR(SUM(PMT_orig)=0,AC8=\" \"),\" \",SQRT(VAR(IF(Group_orig=AC6,PMT_orig)))/AC12)","v":" "},{"$f":"+IF(SUM(INPUT!P$34:Y$34)=0,\" \",IF(SUM(T19:AC19)=0,\" \",SQRT(IF(T$8=\" \",0,(INPUT!P$34/INPUT!Z$34)*($T19*$T12)^2)+IF(U$8=\" \",0,(INPUT!Q$34/INPUT!Z$34)*($U19*$U12)^2)+IF(V$8=\" \",0,(INPUT!R$34/INPUT!Z$34)*($V19*$V12)^2)+IF(W$8=\" \",0,(INPUT!S$34/INPUT!Z$34)*($W19*$W12)^2)+IF(X$8=\" \",0,(INPUT!T$34/INPUT!Z$34)*($X19*$X12)^2)+IF(Y$8=\" \",0,(INPUT!U$34/INPUT!Z$34)*($Y19*$Y12)^2)+IF(Z$8=\" \",0,(INPUT!V$34/INPUT!Z$34)*($Z19*$Z12)^2)+IF(AA$8=\" \",0,(INPUT!W$34/INPUT!Z$34)*($AA19*$AA12)^2)+IF(AB$8=\" \",0,(INPUT!X$34/INPUT!Z$34)*($AB19*$AB12)^2)+IF(AC$8=\" \",0,(INPUT!Y$34/INPUT!Z$34)*($AC19*$AC12)^2))/AD12))","v":" "}]
[null,"     PPMT",null,{"$f":"+IF(SUM(PPMT)=0,\" \",SQRT(VAR(PPMT))/D13)","v":0.97161480295388813},{"$f":"+IF(OR(SUM(PPMT)=0,E8=\" \"),\" \",SQRT(VAR(IF(Group=E6,PPMT)))/E13)","v":1.0726672315598473},{"$f":"+IF(OR(SUM(PPMT)=0,F8=\" \"),\" \",SQRT(VAR(IF(Group=F6,PPMT)))/F13)","v":0.76636925577264181},{"$f":"+IF(OR(SUM(PPMT)=0,G8=\" \"),\" \",SQRT(VAR(IF(Group=G6,PPMT)))/G13)","v":0.61287626178097809},{"$f":"+IF(OR(SUM(PPMT)=0,H8=\" \"),\" \",SQRT(VAR(IF(Group=H6,PPMT)))/H13)","v":" "},{"$f":"+IF(OR(SUM(PPMT)=0,I8=\" \"),\" \",SQRT(VAR(IF(Group=I6,PPMT)))/I13)","v":" "},{"$f":"+IF(OR(SUM(PPMT)=0,J8=\" \"),\" \",SQRT(VAR(IF(Group=J6,PPMT)))/J13)","v":" "},{"$f":"+IF(OR(SUM(PPMT)=0,K8=\" \"),\" \",SQRT(VAR(IF(Group=K6,PPMT)))/K13)","v":" "},{"$f":"+IF(OR(SUM(PPMT)=0,L8=\" \"),\" \",SQRT(VAR(IF(Group=L6,PPMT)))/L13)","v":" "},{"$f":"+IF(OR(SUM(PPMT)=0,M8=\" \"),\" \",SQRT(VAR(IF(Group=M6,PPMT)))/M13)","v":" "},{"$f":"+IF(OR(SUM(PPMT)=0,N8=\" \"),\" \",SQRT(VAR(IF(Group=N6,PPMT)))/N13)","v":" "},{"$f":"+IF(SUM(INPUT!D34:M34)=0,\" \",IF(SUM(E20:N20)=0,\" \",SQRT(IF(E$8=\" \",0,(INPUT!D$34/INPUT!N$34)*($E20*$E13)^2)+IF(F$8=\" \",0,(INPUT!E$34/INPUT!N$34)*($F20*$F13)^2)+IF(G$8=\" \",0,(INPUT!F$34/INPUT!N$34)*($G20*$G13)^2)+IF(H$8=\" \",0,(INPUT!G$34/INPUT!N$34)*($H20*$H13)^2)+IF(I$8=\" \",0,(INPUT!H$34/INPUT!N$34)*($I20*$I13)^2)+IF(J$8=\" \",0,(INPUT!I$34/INPUT!N$34)*($J20*$J13)^2)+IF(K$8=\" \",0,(INPUT!J$34/INPUT!N$34)*($K20*$K13)^2)+IF(L$8=\" \",0,(INPUT!K$34/INPUT!N$34)*($L20*$L13)^2)+IF(M$8=\" \",0,(INPUT!L$34/INPUT!N$34)*($M20*$M13)^2)+IF(N$8=\" \",0,(INPUT!M$34/INPUT!N$34)*($N20*$N13)^2))/O13))","v":0.81933833551110258},null,"     PPMT",null,{"$f":"+IF(SUM(PPMT_orig)=0,\" \",SQRT(VAR(PPMT_orig))/S13)","v":" "},{"$f":"+IF(OR(SUM(PPMT_orig)=0,T8=\" \"),\" \",SQRT(VAR(IF(Group_orig=T6,PPMT_orig)))/T13)","v":" "},{"$f":"+IF(OR(SUM(PPMT_orig)=0,U8=\" \"),\" \",SQRT(VAR(IF(Group_orig=U6,PPMT_orig)))/U13)","v":" "},{"$f":"+IF(OR(SUM(PPMT_orig)=0,V8=\" \"),\" \",SQRT(VAR(IF(Group_orig=V6,PPMT_orig)))/V13)","v":" "},{"$f":"+IF(OR(SUM(PPMT_orig)=0,W8=\" \"),\" \",SQRT(VAR(IF(Group_orig=W6,PPMT_orig)))/W13)","v":" "},{"$f":"+IF(OR(SUM(PPMT_orig)=0,X8=\" \"),\" \",SQRT(VAR(IF(Group_orig=X6,PPMT_orig)))/X13)","v":" "},{"$f":"+IF(OR(SUM(PPMT_orig)=0,Y8=\" \"),\" \",SQRT(VAR(IF(Group_orig=Y6,PPMT_orig)))/Y13)","v":" "},{"$f":"+IF(OR(SUM(PPMT_orig)=0,Z8=\" \"),\" \",SQRT(VAR(IF(Group_orig=Z6,PPMT_orig)))/Z13)","v":" "},{"$f":"+IF(OR(SUM(PPMT_orig)=0,AA8=\" \"),\" \",SQRT(VAR(IF(Group_orig=AA6,PPMT_orig)))/AA13)","v":" "},{"$f":"+IF(OR(SUM(PPMT_orig)=0,AB8=\" \"),\" \",SQRT(VAR(IF(Group_orig=AB6,PPMT_orig)))/AB13)","v":" "},{"$f":"+IF(OR(SUM(PPMT_orig)=0,AC8=\" \"),\" \",SQRT(VAR(IF(Group_orig=AC6,PPMT_orig)))/AC13)","v":" "},{"$f":"+IF(SUM(INPUT!P$34:Y$34)=0,\" \",IF(SUM(T20:AC20)=0,\" \",SQRT(IF(T$8=\" \",0,(INPUT!P$34/INPUT!Z$34)*($T20*$T13)^2)+IF(U$8=\" \",0,(INPUT!Q$34/INPUT!Z$34)*($U20*$U13)^2)+IF(V$8=\" \",0,(INPUT!R$34/INPUT!Z$34)*($V20*$V13)^2)+IF(W$8=\" \",0,(INPUT!S$34/INPUT!Z$34)*($W20*$W13)^2)+IF(X$8=\" \",0,(INPUT!T$34/INPUT!Z$34)*($X20*$X13)^2)+IF(Y$8=\" \",0,(INPUT!U$34/INPUT!Z$34)*($Y20*$Y13)^2)+IF(Z$8=\" \",0,(INPUT!V$34/INPUT!Z$34)*($Z20*$Z13)^2)+IF(AA$8=\" \",0,(INPUT!W$34/INPUT!Z$34)*($AA20*$AA13)^2)+IF(AB$8=\" \",0,(INPUT!X$34/INPUT!Z$34)*($AB20*$AB13)^2)+IF(AC$8=\" \",0,(INPUT!Y$34/INPUT!Z$34)*($AC20*$AC13)^2))/AD13))","v":" "}]
[null,"     APTL-100% UPT by Group",null,{"$f":"+IF(OR(SUM(UPT)=0,SUM(PMT)=0),\" \",SQRT(D18^2+D19^2-2*D26*(D18*D19)))","v":0.37982369418251544},{"$f":"+IF(OR(SUM(UPT)=0,SUM(PMT)=0,E$8=\" \"),\" \",SQRT(E$19^2+E$18^2-2*E$26*(E$19*E$18)))","v":0.43402848601225663},0.35854253479553899,0.22770770387296013," "," "," "," "," "," "," ",{"$f":"+IF(SUM(INPUT!D$34:M$34)=0,\" \",IF(SUM(E21:N21)=0,\" \",SQRT(IF(E$8=\" \",0,(INPUT!D$34/INPUT!N$34)*($E21*$E$12)^2)+IF(F$8=\" \",0,(INPUT!E$34/INPUT!N$34)*($F21*$F$12)^2)+IF(G$8=\" \",0,(INPUT!F$34/INPUT!N$34)*($G21*$G$12)^2)+IF(H$8=\" \",0,(INPUT!G$34/INPUT!N$34)*($H21*$H$12)^2)+IF(I$8=\" \",0,(INPUT!H$34/INPUT!N$34)*($I21*$I$12)^2)+IF(J$8=\" \",0,(INPUT!I$34/INPUT!N$34)*($J21*$J$12)^2)+IF(K$8=\" \",0,(INPUT!J$34/INPUT!N$34)*($K21*$K$12)^2)+IF(L$8=\" \",0,(INPUT!K$34/INPUT!N$34)*($L21*$L$12)^2)+IF(M$8=\" \",0,(INPUT!L$34/INPUT!N$34)*($M21*$M$12)^2)+IF(N$8=\" \",0,(INPUT!M$34/INPUT!N$34)*($N21*$N$12)^2))/O$12))","v":0.36598840404260147},null,"     APTL-100% UPT by Group",null,{"$f":"+IF(OR(SUM(UPT_orig)=0,SUM(PMT_orig)=0),\" \",SQRT(S18^2+S19^2-2*S26*(S18*S19)))","v":" "},{"$f":"+IF(OR(SUM(UPT_orig)=0,SUM(PMT_orig)=0,T$8=\" \"),\" \",SQRT(T$19^2+T$18^2-2*T$26*(T$19*T$18)))","v":" "}," "," "," "," "," "," "," "," "," ",{"$f":"+IF(SUM(INPUT!P$34:Y$34)=0,\" \",IF(SUM(T21:AC21)=0,\" \",SQRT(IF(T$8=\" \",0,(INPUT!P$34/INPUT!Z$34)*($T21*$T12)^2)+IF(U$8=\" \",0,(INPUT!Q$34/INPUT!Z$34)*($U21*$U12)^2)+IF(V$8=\" \",0,(INPUT!R$34/INPUT!Z$34)*($V21*$V12)^2)+IF(W$8=\" \",0,(INPUT!S$34/INPUT!Z$34)*($W21*$W12)^2)+IF(X$8=\" \",0,(INPUT!T$34/INPUT!Z$34)*($X21*$X12)^2)+IF(Y$8=\" \",0,(INPUT!U$34/INPUT!Z$34)*($Y21*$Y12)^2)+IF(Z$8=\" \",0,(INPUT!V$34/INPUT!Z$34)*($Z21*$Z12)^2)+IF(AA$8=\" \",0,(INPUT!W$34/INPUT!Z$34)*($AA21*$AA12)^2)+IF(AB$8=\" \",0,(INPUT!X$34/INPUT!Z$34)*($AB21*$AB12)^2)+IF(AC$8=\" \",0,(INPUT!Y$34/INPUT!Z$34)*($AC21*$AC12)^2))/AD12))","v":" "}]
[null,"     APTL-100% UPT Total",null,"N/A",{"$f":"+IF(OR(SUM(UPT)=0,SUM(PMT)=0,E$8=\" \"),\" \",SQRT(E$19^2+($O14/E14)^2*E$18^2-2*E$26*($O14/E14)*(E$19*E$18)))","v":0.48180100337958615},0.35824463267436535,0.245057266138591," "," "," "," "," "," "," ",{"$f":"+IF(SUM(INPUT!D$34:M$34)=0,\" \",IF(SUM(E22:N22)=0,\" \",SQRT(IF(E$8=\" \",0,(INPUT!D$34/INPUT!N$34)*($E22*$E$12)^2)+IF(F$8=\" \",0,(INPUT!E$34/INPUT!N$34)*($F22*$F$12)^2)+IF(G$8=\" \",0,(INPUT!F$34/INPUT!N$34)*($G22*$G$12)^2)+IF(H$8=\" \",0,(INPUT!G$34/INPUT!N$34)*($H22*$H$12)^2)+IF(I$8=\" \",0,(INPUT!H$34/INPUT!N$34)*($I22*$I$12)^2)+IF(J$8=\" \",0,(INPUT!I$34/INPUT!N$34)*($J22*$J$12)^2)+IF(K$8=\" \",0,(INPUT!J$34/INPUT!N$34)*($K22*$K$12)^2)+IF(L$8=\" \",0,(INPUT!K$34/INPUT!N$34)*($L22*$L$12)^2)+IF(M$8=\" \",0,(INPUT!L$34/INPUT!N$34)*($M22*$M$12)^2)+IF(N$8=\" \",0,(INPUT!M$34/INPUT!N$34)*($N22*$N$12)^2))/O$12))","v":0.36944164428900855},null,"     APTL-100% UPT Total",null,"N/A",{"$f":"+IF(OR(SUM(UPT_orig)=0,SUM(PMT_orig)=0,T$8=\" \"),\" \",SQRT(T$19^2+($O14/T14)^2*T$18^2-2*T$26*($O14/T14)*(T$19*T$18)))","v":" "}," "," "," "," "," "," "," "," "," ",{"$f":"+IF(SUM(INPUT!P$34:Y$34)=0,\" \",IF(SUM(T22:AC22)=0,\" \",SQRT(IF(T$8=\" \",0,(INPUT!P$34/INPUT!Z$34)*($T22*$T12)^2)+IF(U$8=\" \",0,(INPUT!Q$34/INPUT!Z$34)*($U22*$U12)^2)+IF(V$8=\" \",0,(INPUT!R$34/INPUT!Z$34)*($V22*$V12)^2)+IF(W$8=\" \",0,(INPUT!S$34/INPUT!Z$34)*($W22*$W12)^2)+IF(X$8=\" \",0,(INPUT!T$34/INPUT!Z$34)*($X22*$X12)^2)+IF(Y$8=\" \",0,(INPUT!U$34/INPUT!Z$34)*($Y22*$Y12)^2)+IF(Z$8=\" \",0,(INPUT!V$34/INPUT!Z$34)*($Z22*$Z12)^2)+IF(AA$8=\" \",0,(INPUT!W$34/INPUT!Z$34)*($AA22*$AA12)^2)+IF(AB$8=\" \",0,(INPUT!X$34/INPUT!Z$34)*($AB22*$AB12)^2)+IF(AC$8=\" \",0,(INPUT!Y$34/INPUT!Z$34)*($AC22*$AC12)^2))/AD12))","v":" "}]
[null,"     PMT/PPMT",null,{"$f":"+IF(OR(SUM(PMT)=0,SUM(PPMT)=0),\" \",SQRT(D19^2+D20^2-2*D27*(D19*D20)))","v":0.49232169710824442},{"$f":"+IF(OR(SUM(PMT)=0,SUM(PPMT)=0,E$8=\" \"),\" \",SQRT(E$19^2+E$20^2-2*E$27*(E$20*E$19)))","v":0.61039554819132369},0.37302137833033794,0.22915769356537385," "," "," "," "," "," "," ",{"$f":"+IF(SUM(INPUT!D$34:M$34)=0,\" \",IF(SUM(E23:N23)=0,\" \",SQRT(IF(E$8=\" \",0,(INPUT!D$34/INPUT!N$34)*($E23*$E$12)^2)+IF(F$8=\" \",0,(INPUT!E$34/INPUT!N$34)*($F23*$F$12)^2)+IF(G$8=\" \",0,(INPUT!F$34/INPUT!N$34)*($G23*$G$12)^2)+IF(H$8=\" \",0,(INPUT!G$34/INPUT!N$34)*($H23*$H$12)^2)+IF(I$8=\" \",0,(INPUT!H$34/INPUT!N$34)*($I23*$I$12)^2)+IF(J$8=\" \",0,(INPUT!I$34/INPUT!N$34)*($J23*$J$12)^2)+IF(K$8=\" \",0,(INPUT!J$34/INPUT!N$34)*($K23*$K$12)^2)+IF(L$8=\" \",0,(INPUT!K$34/INPUT!N$34)*($L23*$L$12)^2)+IF(M$8=\" \",0,(INPUT!L$34/INPUT!N$34)*($M23*$M$12)^2)+IF(N$8=\" \",0,(INPUT!M$34/INPUT!N$34)*($N23*$N$12)^2))/O$12))","v":0.38638189915371773},null,"     PMT/PPMT",null,{"$f":"+IF(OR(SUM(PMT_orig)=0,SUM(PPMT_orig)=0),\" \",SQRT(S19^2+S20^2-2*S27*(S19*S20)))","v":" "},{"$f":"+IF(OR(SUM(PMT_orig)=0,SUM(PPMT_orig)=0,T$8=\" \"),\" \",SQRT(T$19^2+T$20^2-2*T$27*(T$20*T$19)))","v":" "}," "," "," "," "," "," "," "," "," ",{"$f":"+IF(SUM(INPUT!P$34:Y$34)=0,\" \",IF(SUM(T23:AC23)=0,\" \",SQRT(IF(T$8=\" \",0,(INPUT!P$34/INPUT!Z$34)*($T23*$T12)^2)+IF(U$8=\" \",0,(INPUT!Q$34/INPUT!Z$34)*($U23*$U12)^2)+IF(V$8=\" \",0,(INPUT!R$34/INPUT!Z$34)*($V23*$V12)^2)+IF(W$8=\" \",0,(INPUT!S$34/INPUT!Z$34)*($W23*$W12)^2)+IF(X$8=\" \",0,(INPUT!T$34/INPUT!Z$34)*($X23*$X12)^2)+IF(Y$8=\" \",0,(INPUT!U$34/INPUT!Z$34)*($Y23*$Y12)^2)+IF(Z$8=\" \",0,(INPUT!V$34/INPUT!Z$34)*($Z23*$Z12)^2)+IF(AA$8=\" \",0,(INPUT!W$34/INPUT!Z$34)*($AA23*$AA12)^2)+IF(AB$8=\" \",0,(INPUT!X$34/INPUT!Z$34)*($AB23*$AB12)^2)+IF(AC$8=\" \",0,(INPUT!Y$34/INPUT!Z$34)*($AC23*$AC12)^2))/AD12))","v":" "}]
[]
[null,"Correlation Coefficient",null,null,null,null,null,null,null,null,null,null,null,null," ",null,"Correlation Coefficient",null,null,null,null,null,null,null,null,null,null,null,null," "]
[null,"     UPT & PMT",null,{"$f":"+IF(OR(SUM(UPT)=0,SUM(PMT)=0),\" \",CORREL(UPT,PMT))","v":0.89473595274741557},{"$f":"+IF(OR(SUM(UPT)=0,SUM(PMT)=0,E8=\" \"),\" \",CORREL(IF(Group=E6,UPT),IF(Group=E6,PMT)))","v":0.93656705789113182},{"$f":"+IF(OR(SUM(UPT)=0,SUM(PMT)=0,F8=\" \"),\" \",CORREL(IF(Group=F6,UPT),IF(Group=F6,PMT)))","v":0.87424369004157243},{"$f":"+IF(OR(SUM(UPT)=0,SUM(PMT)=0,G8=\" \"),\" \",CORREL(IF(Group=G6,UPT),IF(Group=G6,PMT)))","v":0.93083488575658258},{"$f":"+IF(OR(SUM(UPT)=0,SUM(PMT)=0,H8=\" \"),\" \",CORREL(IF(Group=H6,UPT),IF(Group=H6,PMT)))","v":" "},{"$f":"+IF(OR(SUM(UPT)=0,SUM(PMT)=0,I8=\" \"),\" \",CORREL(IF(Group=I6,UPT),IF(Group=I6,PMT)))","v":" "},{"$f":"+IF(OR(SUM(UPT)=0,SUM(PMT)=0,J8=\" \"),\" \",CORREL(IF(Group=J6,UPT),IF(Group=J6,PMT)))","v":" "},{"$f":"+IF(OR(SUM(UPT)=0,SUM(PMT)=0,K8=\" \"),\" \",CORREL(IF(Group=K6,UPT),IF(Group=K6,PMT)))","v":" "},{"$f":"+IF(OR(SUM(UPT)=0,SUM(PMT)=0,L8=\" \"),\" \",CORREL(IF(Group=L6,UPT),IF(Group=L6,PMT)))","v":" "},{"$f":"+IF(OR(SUM(UPT)=0,SUM(PMT)=0,M8=\" \"),\" \",CORREL(IF(Group=M6,UPT),IF(Group=M6,PMT)))","v":" "},{"$f":"+IF(OR(SUM(UPT)=0,SUM(PMT)=0,N8=\" \"),\" \",CORREL(IF(Group=N6,UPT),IF(Group=N6,PMT)))","v":" "},"N/A",null,"     UPT & PMT",null,{"$f":"+IF(OR(SUM(UPT_orig)=0,SUM(PMT_orig)=0),\" \",CORREL(UPT_orig,PMT_orig))","v":" "},{"$f":"+IF(OR(SUM(UPT_orig)=0,SUM(PMT_orig)=0,T8=\" \"),\" \",CORREL(IF(Group_orig=T6,UPT_orig),IF(Group_orig=T6,PMT_orig)))","v":" "},{"$f":"+IF(OR(SUM(UPT_orig)=0,SUM(PMT_orig)=0,U8=\" \"),\" \",CORREL(IF(Group_orig=U6,UPT_orig),IF(Group_orig=U6,PMT_orig)))","v":" "},{"$f":"+IF(OR(SUM(UPT_orig)=0,SUM(PMT_orig)=0,V8=\" \"),\" \",CORREL(IF(Group_orig=V6,UPT_orig),IF(Group_orig=V6,PMT_orig)))","v":" "},{"$f":"+IF(OR(SUM(UPT_orig)=0,SUM(PMT_orig)=0,W8=\" \"),\" \",CORREL(IF(Group_orig=W6,UPT_orig),IF(Group_orig=W6,PMT_orig)))","v":" "},{"$f":"+IF(OR(SUM(UPT_orig)=0,SUM(PMT_orig)=0,X8=\" \"),\" \",CORREL(IF(Group_orig=X6,UPT_orig),IF(Group_orig=X6,PMT_orig)))","v":" "},{"$f":"+IF(OR(SUM(UPT_orig)=0,SUM(PMT_orig)=0,Y8=\" \"),\" \",CORREL(IF(Group_orig=Y6,UPT_orig),IF(Group_orig=Y6,PMT_orig)))","v":" "},{"$f":"+IF(OR(SUM(UPT_orig)=0,SUM(PMT_orig)=0,Z8=\" \"),\" \",CORREL(IF(Group_orig=Z6,UPT_orig),IF(Group_orig=Z6,PMT_orig)))","v":" "},{"$f":"+IF(OR(SUM(UPT_orig)=0,SUM(PMT_orig)=0,AA8=\" \"),\" \",CORREL(IF(Group_orig=AA6,UPT_orig),IF(Group_orig=AA6,PMT_orig)))","v":" "},{"$f":"+IF(OR(SUM(UPT_orig)=0,SUM(PMT_orig)=0,AB8=\" \"),\" \",CORREL(IF(Group_orig=AB6,UPT_orig),IF(Group_orig=AB6,PMT_orig)))","v":" "},{"$f":"+IF(OR(SUM(UPT_orig)=0,SUM(PMT_orig)=0,AC8=\" \"),\" \",CORREL(IF(Group_orig=AC6,UPT_orig),IF(Group_orig=AC6,PMT_orig)))","v":" "},"N/A"]
[null,"     PMT & PPMT",null,{"$f":"+IF(OR(SUM(PMT)=0,SUM(PPMT)=0),\" \",CORREL(PMT,PPMT))","v":0.8622184849236646},{"$f":"+IF(OR(SUM(PMT)=0,SUM(PPMT)=0,E8=\" \"),\" \",CORREL(IF(Group=E6,PMT),IF(Group=E6,PPMT)))","v":0.85408131666372988},{"$f":"+IF(OR(SUM(PMT)=0,SUM(PPMT)=0,F8=\" \"),\" \",CORREL(IF(Group=F6,PMT),IF(Group=F6,PPMT)))","v":0.8775850531698226},{"$f":"+IF(OR(SUM(PMT)=0,SUM(PPMT)=0,G8=\" \"),\" \",CORREL(IF(Group=G6,PMT),IF(Group=G6,PPMT)))","v":0.93103843255819074},{"$f":"+IF(OR(SUM(PMT)=0,SUM(PPMT)=0,H8=\" \"),\" \",CORREL(IF(Group=H6,PMT),IF(Group=H6,PPMT)))","v":" "},{"$f":"+IF(OR(SUM(PMT)=0,SUM(PPMT)=0,I8=\" \"),\" \",CORREL(IF(Group=I6,PMT),IF(Group=I6,PPMT)))","v":" "},{"$f":"+IF(OR(SUM(PMT)=0,SUM(PPMT)=0,J8=\" \"),\" \",CORREL(IF(Group=J6,PMT),IF(Group=J6,PPMT)))","v":" "},{"$f":"+IF(OR(SUM(PMT)=0,SUM(PPMT)=0,K8=\" \"),\" \",CORREL(IF(Group=K6,PMT),IF(Group=K6,PPMT)))","v":" "},{"$f":"+IF(OR(SUM(PMT)=0,SUM(PPMT)=0,L8=\" \"),\" \",CORREL(IF(Group=L6,PMT),IF(Group=L6,PPMT)))","v":" "},{"$f":"+IF(OR(SUM(PMT)=0,SUM(PPMT)=0,M8=\" \"),\" \",CORREL(IF(Group=M6,PMT),IF(Group=M6,PPMT)))","v":" "},{"$f":"+IF(OR(SUM(PMT)=0,SUM(PPMT)=0,N8=\" \"),\" \",CORREL(IF(Group=N6,PMT),IF(Group=N6,PPMT)))","v":" "},"N/A",null,"     PMT & PPMT",null,{"$f":"+IF(OR(SUM(PMT_orig)=0,SUM(PPMT_orig)=0),\" \",CORREL(PMT_orig,PPMT_orig))","v":" "},{"$f":"+IF(OR(SUM(PMT_orig)=0,SUM(PPMT_orig)=0,T8=\" \"),\" \",CORREL(IF(Group_orig=T6,PMT_orig),IF(Group_orig=T6,PPMT_orig)))","v":" "},{"$f":"+IF(OR(SUM(PMT_orig)=0,SUM(PPMT_orig)=0,U8=\" \"),\" \",CORREL(IF(Group_orig=U6,PMT_orig),IF(Group_orig=U6,PPMT_orig)))","v":" "},{"$f":"+IF(OR(SUM(PMT_orig)=0,SUM(PPMT_orig)=0,V8=\" \"),\" \",CORREL(IF(Group_orig=V6,PMT_orig),IF(Group_orig=V6,PPMT_orig)))","v":" "},{"$f":"+IF(OR(SUM(PMT_orig)=0,SUM(PPMT_orig)=0,W8=\" \"),\" \",CORREL(IF(Group_orig=W6,PMT_orig),IF(Group_orig=W6,PPMT_orig)))","v":" "},{"$f":"+IF(OR(SUM(PMT_orig)=0,SUM(PPMT_orig)=0,X8=\" \"),\" \",CORREL(IF(Group_orig=X6,PMT_orig),IF(Group_orig=X6,PPMT_orig)))","v":" "},{"$f":"+IF(OR(SUM(PMT_orig)=0,SUM(PPMT_orig)=0,Y8=\" \"),\" \",CORREL(IF(Group_orig=Y6,PMT_orig),IF(Group_orig=Y6,PPMT_orig)))","v":" "},{"$f":"+IF(OR(SUM(PMT_orig)=0,SUM(PPMT_orig)=0,Z8=\" \"),\" \",CORREL(IF(Group_orig=Z6,PMT_orig),IF(Group_orig=Z6,PPMT_orig)))","v":" "},{"$f":"+IF(OR(SUM(PMT_orig)=0,SUM(PPMT_orig)=0,AA8=\" \"),\" \",CORREL(IF(Group_orig=AA6,PMT_orig),IF(Group_orig=AA6,PPMT_orig)))","v":" "},{"$f":"+IF(OR(SUM(PMT_orig)=0,SUM(PPMT_orig)=0,AB8=\" \"),\" \",CORREL(IF(Group_orig=AB6,PMT_orig),IF(Group_orig=AB6,PPMT_orig)))","v":" "},{"$f":"+IF(OR(SUM(PMT_orig)=0,SUM(PPMT_orig)=0,AC8=\" \"),\" \",CORREL(IF(Group_orig=AC6,PMT_orig),IF(Group_orig=AC6,PPMT_orig)))","v":" "},"N/A"]
[]
[]
[null,"B. Description"]
[]
[null,"Measures"]
[null,"    Group Size in the Sample = the number of service units contained in the sample data that have been entered into INPUT.  "]
[null,"    Average = sample mean"]
[null,"    Unit Coefficient of Variation = a statistical measure of the degree of variation in a particular variable.  A lower value is more desirable."]
[null,"    Correlation Coefficient = a statistical measure of how closely two variables relate to each other.  It ranges between 0 and 1.  A higher value is better."]
[]
[null,"Variables"]
[null,"    UPT = unlinked passenger trips"]
[null,"    PMT = passenger miles traveled"]
[null,"    PPMT = UPT * average route length = potential passenger miles traveled"]
[null,"    APTL = PMT/UPT = average passegner trip length"]
[null,"    PMT/PPMT = ratio of PMT to PPMT = fraction of a route's length traveled by the average passenger"]

{"sheet":"REVISION","index":4,"n_rows":40,"n_cols":28,"rows_kept":40,"cut":false,"hidden":false,"merged":[[4,2,4,3],[6,1,6,3],[29,1,35,10]]}
[null,"Information for Considering Plan Revision"]
[null,"You must revise your sampling plan periodically to ensure that it continues to meet FTA's statistical standards. Please refer to the NTD Sampling Manual sections on \"Revision\" to learn when you must revise your plan. If this is your mandatory revision year as described in the manual, use this tab to revise your plan."]
[null,"A. Sample Size"]
[null,null,55,null,null,37,null,"crit val","groups?","100%?","PPMT?","Option"]
[null,"Sample Size",{"$f":"CALCULATIONS!D8","v":549},null,{"$f":"COUNTIFS($P$27:$AB$27,\"<=\"&C4)","v":6},{"$f":"CALCULATIONS!S8","v":" "},{"$f":"COUNTIFS($P$27:$AB$27,\"<=\"&F4)","v":3},{"$f":"INDEX(P28:AB40,G5,E5)","v":1.72},1,{"$f":"INPUT!M52","v":1},null,{"$f":"INDEX($B$10:$B$13,IF($J$5=0,1,IF($K$5=1,4,2)))&\" - \"&IF($I$5=1,D9,C9)","v":"APTL Option - 100% UPT Total - Grouping"}]
[null,null,null,null,null,null,null,null,null,null,null,{"$f":"INDEX($K$10:$L$13,IF($J$5=0,1,IF($K$5=1,4,IF(I5=1,3,2))),IF(I5=1,2,1))","v":""}]
[null,"B. Statistical Variation by Efficiency Options"]
[]
[null,"Efficiency Options","No Grouping","Grouping",null,"Efficiency Options","No Grouping","Grouping",null,"Efficiency Options","No Grouping","Grouping"]
[null,"Base Option",{"$f":"+IF(OR(CALCULATIONS!D19=\" \",CALCULATIONS!D12=\" \"),\" \",(CALCULATIONS!D19*CALCULATIONS!D12)^2)","v":6986.0022734101585},{"$f":"+IF(OR(CALCULATIONS!O19=\" \",CALCULATIONS!O12=\" \"),\" \",(CALCULATIONS!O19*CALCULATIONS!O12)^2)","v":5683.0572681850053},null,"Base Option",{"$f":"+IF(OR(CALCULATIONS!S19=\" \",CALCULATIONS!S12=\" \"),\" \",(CALCULATIONS!S19*CALCULATIONS!S12)^2)","v":" "},{"$f":"+IF(OR(CALCULATIONS!AD19=\" \",CALCULATIONS!AD12=\" \"),\" \",(CALCULATIONS!AD19*CALCULATIONS!AD12)^2)","v":" "},null,"Base Option",{"$f":"IFERROR(C10/G10,\"\")","v":""},{"$f":"IFERROR(D10/H10,\"\")","v":""}]
[null,"APTL Option - 100% UPT Total",{"$f":"+IF(OR(CALCULATIONS!D21=\" \",CALCULATIONS!D12=\" \"),\" \",(CALCULATIONS!D21*CALCULATIONS!D12)^2)","v":1393.5516079999234},{"$f":"+IF(OR(CALCULATIONS!O$22=\" \",CALCULATIONS!O$12=\" \"),\" \",(CALCULATIONS!O$22*CALCULATIONS!O$12)^2)","v":1267.9194495605821},null,"APTL Option - 100% UPT Total",{"$f":"+IF(OR(CALCULATIONS!S21=\" \",CALCULATIONS!S12=\" \"),\" \",(CALCULATIONS!S21*CALCULATIONS!S12)^2)","v":" "},{"$f":"+IF(OR(CALCULATIONS!AD$22=\" \",CALCULATIONS!AD$12=\" \"),\" \",(CALCULATIONS!AD$22*CALCULATIONS!AD$12)^2)","v":" "},null,"APTL Option - 100% UPT Total",{"$f":"IFERROR(C11/G11,\"\")","v":""},{"$f":"IFERROR(D11/H11,\"\")","v":""}]
[null,"APTL Option - 100% UPT by Group","N/A",{"$f":"+IF(INPUT!M52=0,\"\",IF(OR(CALCULATIONS!O$21=\" \",CALCULATIONS!O$12=\" \"),\" \",(CALCULATIONS!O$21*CALCULATIONS!O$12)^2))","v":1244.3272664110398},null,"APTL Option - 100% UPT by Group","N/A",{"$f":"+IF(INPUT!M52=0,\"\",IF(OR(CALCULATIONS!AD$21=\" \",CALCULATIONS!AD$12=\" \"),\" \",(CALCULATIONS!AD$21*CALCULATIONS!AD$12)^2))","v":" "},null,"APTL Option - 100% UPT by Group","N/A",{"$f":"IFERROR(D12/H12,\"\")","v":""}]
[null,"PPMT Option",{"$f":"+IF(OR(CALCULATIONS!D23=\" \",CALCULATIONS!D12=\" \"),\" \",(CALCULATIONS!D23*CALCULATIONS!D12)^2)","v":2341.2991199170478},{"$f":"+IF(OR(CALCULATIONS!O23=\" \",CALCULATIONS!O12=\" \"),\" \",(CALCULATIONS!O23*CALCULATIONS!O12)^2)","v":1386.8628424257515},null,"PPMT Option",{"$f":"+IF(OR(CALCULATIONS!S23=\" \",CALCULATIONS!S12=\" \"),\" \",(CALCULATIONS!S23*CALCULATIONS!S12)^2)","v":" "},{"$f":"+IF(OR(CALCULATIONS!AD23=\" \",CALCULATIONS!AD12=\" \"),\" \",(CALCULATIONS!AD23*CALCULATIONS!AD12)^2)","v":" "},null,"PPMT Option",{"$f":"IFERROR(C13/G13,\"\")","v":""},{"$f":"IFERROR(D13/H13,\"\")","v":""}]
[]
[null,"Notes:"]
[null,"1. APTL Option - 100% UPT Total applies if cell M52 = 0 in the Input Worksheet."]
[null,"2. APTL Option - 100% UPT by Group applies otherwise."]
[null,"Follow these steps to determine whether you need to revise your sampling plan:"]
[null,"1. Enter your most recent prior year sampling data in the INPUT tab, in the table starting in cell B71."]
[null,"2. Enter the sampling data you used to develop your current sampling plan in the INPUT tab, in the table starting in cell J71. For example, if you used a Ready-to-Use Sampling Plan in 2023, then used the NTD Sampling Template in 2026, used the same plan in 2029, and are now revising your sampling plan for 2032, enter your 2029 sampling data in the table starting at B71, and your 2023 sampling data in the table starting at J71."]
[null,"3. Make sure to enter a value in INPUT cell M52: If 100% counts of UPT are available by service group, enter 1 in cell M52. If not, enter 0."]
[null,"4. If you use route grouping, enter the group sizes for the most recent prior year sample in the table starting in INPUT cell D34. For the original (older) sampling data, enter the group sizes starting in INPUT cell P34. Enter \"1\" in REVISION cell I5."]
[null,"5. If you use the PPMT option, enter \"1\" in REVISION cell K5."]
[null,"6. Confirm that REVISION cell L5 correctly describes your sampling method."]
[null,"7. See the results below."]
[null,null,null,null,null,null,null,null,null,null,null,null,null,null,"Size of Base Sample","Size of Current Sample"]
[null,{"$f":"IF(L6<=H5,\"You do not need to revise your sampling plan. Continue to use the same sampling plan as in your most recent prior year sample.\",\"You must revise your sampling plan. Refer to the SAMPLING PLANS tab and select one of the plans according to the instructions on that tab.\")","v":"You must revise your sampling plan. Refer to the SAMPLING PLANS tab and select one of the plans according to the instructions on that tab."},null,null,null,null,null,null,null,null,null,null,null,null,null,25,30,35,40,45,50,75,100,150,200,300,400,600]
[null,null,null,null,null,null,null,null,null,null,null,null,null,null,25,1.98,1.95,1.92,1.9,1.88,1.86,1.82,1.8,1.78,1.77,1.76,1.75,1.74]
[null,"Q: How did the template come up with this answer?",null,null,null,null,null,null,null,null,null,null,null,null,30,1.9,1.86,1.83,1.81,1.79,1.78,1.73,1.71,1.69,1.67,1.66,1.66,1.65]
[null,"A: The template compares the statistical characteristics of your most recent sample to the original sample you used to develop your sampling plan. If your service has been fairly consistent since the original sample, the template will usually determine that your original plan is still valid. If you've had big changes in your service, you may need to change your sample size to ensure you're still getting data that meet FTA's requirements.",null,null,null,null,null,null,null,null,null,null,null,null,35,1.84,1.8,1.77,1.75,1.73,1.72,1.67,1.65,1.62,1.61,1.6,1.59,1.58]
[null,null,null,null,null,null,null,null,null,null,null,null,null,null,40,1.8,1.76,1.73,1.7,1.69,1.67,1.62,1.6,1.57,1.56,1.55,1.54,1.53]
[null,null,null,null,null,null,null,null,null,null,null,null,null,null,45,1.77,1.73,1.69,1.67,1.65,1.64,1.59,1.56,1.53,1.52,1.51,1.5,1.49]
[null,null,null,null,null,null,null,null,null,null,null,null,null,null,50,1.74,1.7,1.67,1.64,1.62,1.61,1.56,1.53,1.5,1.49,1.47,1.47,1.46]
[null,null,null,null,null,null,null,null,null,null,null,null,null,null,75,1.67,1.62,1.59,1.56,1.54,1.52,1.47,1.44,1.41,1.39,1.38,1.37,1.36]
[null,null,null,null,null,null,null,null,null,null,null,null,null,null,100,1.63,1.58,1.55,1.52,1.5,1.48,1.42,1.39,1.36,1.34,1.33,1.32,1.31]
[null,null,null,null,null,null,null,null,null,null,null,null,null,null,150,1.59,1.54,1.51,1.48,1.46,1.44,1.38,1.35,1.31,1.29,1.27,1.26,1.25]
[null,null,null,null,null,null,null,null,null,null,null,null,null,null,200,1.57,1.52,1.49,1.46,1.44,1.42,1.36,1.32,1.28,1.26,1.24,1.23,1.22]
[null,null,null,null,null,null,null,null,null,null,null,null,null,null,300,1.55,1.51,1.47,1.44,1.42,1.4,1.33,1.3,1.26,1.23,1.21,1.2,1.18]
[null,null,null,null,null,null,null,null,null,null,null,null,null,null,400,1.54,1.5,1.46,1.43,1.41,1.39,1.32,1.28,1.24,1.22,1.19,1.18,1.1599999999999999]
[null,null,null,null,null,null,null,null,null,null,null,null,null,null,600,1.54,1.49,1.45,1.42,1.4,1.38,1.31,1.27,1.23,1.2,1.18,1.1599999999999999,1.1399999999999999]

{"sheet":"RANDOM SELECTOR TOOL","index":5,"n_rows":10,"n_cols":9,"rows_kept":10,"cut":false,"hidden":false,"merged":[]}
["Trip IDs",null,null,null,null,null,null,null,"Trips Selected for Sample"]
[1,"<--Paste your complete list of Trip IDs for the selection period in column A.",null,null,null,null,null,null,7]
[2,5,"<--Enter your sample size for the selection period in cell B3.",null,null,null,null,null,1]
[3,null,"<--Click this button to check the data for errors.",null,null,null,null,null,3]
[4,null,"<--Click this button to select your random sample.",null,null,null,null,null,2]
[5,null,"Your sample will appear in column I. -->",null,null,null,null,null,8]
[9]
[6]
[7]
[8]